{"text_format":"1","workbook":"xlsx","n_sheets":10,"sheets":["Start","Small Project","Title Sheet","Limited Access","Open Access","New Route","Bridge Rehabilitation","Bridge Replacement","Work Day Calc","CostIndex"],"not_rendered":{"charts":0,"images":4,"macros":1,"external_links":0,"defined_names":42,"comments":7,"pivot_tables":0},"unopened":[],"bounds":{"document_bytes":16777216,"sheet_cells":100000,"rows_first":2000,"rows_last":500,"rows_between":2000,"halvings":0,"cell_chars":16384,"cell_head_chars":4096},"cells_cut":0,"cells_raw":0,"read":"whole","date_system":"1900"}

{"sheet":"Start","index":0,"n_rows":1,"n_cols":1,"rows_kept":1,"cut":false,"hidden":false,"merged":[[0,0,16,9]]}
["Please Enable Macros Before Using this Form"]

{"sheet":"Small Project","index":1,"n_rows":19,"n_cols":16,"rows_kept":19,"cut":false,"hidden":false,"merged":[[18,3,19,6],[0,0,0,5],[2,4,2,5],[7,3,7,6],[13,3,14,6],[16,3,16,6]]}
["Estimated Duration for Projects Less Than $1 Million               ",null,null,null,null,null,null,null,null,null,null,null,"Design Desc Range","Mean","Lower 95% CI","Upper 95% CI"]
["Item#               ",null,null,null,null,null,null,null,null,null,null,null,"BRIDGE REHAB",-28.012,-73.848929999999996,17.824936000000001]
["Current Year:",{"$f":"YEAR(TODAY())","v":2015},"Cost Index",{"$f":"IF(ISNA(VLOOKUP(B3,CostIndex!A:E,5,FALSE)),VLOOKUP((B3-1),CostIndex!A:E,5,FALSE),VLOOKUP(B3,CostIndex!A:E,5,FALSE))","v":{"$error":"#N/A"}},"Range",null,null,null,null,null,null,null,"BRIDGE REPLACEMENT",50.771987000000003,30.465602000000001,71.078372000000002]
[null,"Activity","Input Value","Mean Duration (Days)","Lower Duration (Days)","Upper Duration (Days)",null,null,null,null,null,null,"CONGESTION MITIGTN",3.5490811999999998,-49.442830000000001,56.540987999999999]
[null,"Construction Estimate",null,{"$f":"IF($C$6=\"\",0,IF(N12+N13*$C$5*$D$3+VLOOKUP($C$6,$M$2:$P$11,2,FALSE)<1,1,N12+N13*$C$5*$D$3+VLOOKUP($C$6,$M$2:$P$11,2,FALSE)))","v":0},{"$f":"IF($C$6=\"\",0,IF(O12+O13*$C$5*D3+VLOOKUP($C$6,$M$2:$P$11,3,FALSE)<1,1,O12+O13*$C$5*$D$3+VLOOKUP($C$6,$M$2:$P$11,3,FALSE)))","v":0},{"$f":"IF($C$6=\"\",0,IF(P12+P13*$C$5*$D$3+VLOOKUP($C$6,$M$2:$P$11,4,FALSE)<1,1,P12+P13*$C$5*$D$3+VLOOKUP($C$6,$M$2:$P$11,4,FALSE)))","v":0},null,null,null,null,null,null,"GUARDRAIL REPLCMNT",-12.701739999999999,-41.512219999999999,16.108746]
[null,"Select Design Project Type",null,null,null,null,null,null,null,null,null,null,"MINOR WIDENING",-3.3121520000000002,-56.089080000000003,49.464776999999998]
[null,null,null,null,null,null,null,null,null,null,null,null,"NEW ROUTE",2.5356310999999998,-78.592010000000002,83.663274000000001]
[null,null,null,"Schedule Estimator",null,null,null,null,null,null,null,null,"PAVEMENT REHAB",-11.46744,-45.50797,22.573093]
[null,null,null,"Proposed Letting Date",{"$f":"TODAY()","v":"2015-07-22"},null,null,null,null,null,null,null,"RECONSTRUCTION",55.440976999999997,16.420342000000002,94.461612000000002]
[null,null,null,null,"Lower Range","Mean","Upper Range",null,null,null,null,null,"RESURFACING",-71.53783,-138.4699,-4.6057949999999996]
[null,null,null,"Estimated Calendar Days",{"$f":"E5","v":0},{"$f":"D5","v":0},{"$f":"F5","v":0},null,null,null,null,null,"SAFETY/SAFETY-HAZARD ELIM",0,0,0]
[null,null,null,"Estimated Completion Date",{"$f":"E11+E9+'Work Day Calc'!$N$7","v":"2015-08-21T10:00:00"},{"$f":"F11+E9+'Work Day Calc'!$N$7","v":"2015-08-21T10:00:00"},{"$f":"G11+E9+'Work Day Calc'!$N$7","v":"2015-08-21T10:00:00"},null,null,null,null,null,"Intercept",28.741365999999999,7.6043165999999998,49.878414999999997]
[null,null,null,"Estimated Working Days**",{"$f":"INDEX('Work Day Calc'!$S$3:$AD$123,IF(MONTH(E9)>10,ROUNDDOWN(YEAR(E12)-YEAR(E9),0)*12+ROUNDUP(MONTH(E12)+DAY(E12)/30,0)-12,ROUNDDOWN(YEAR(E12)-YEAR(E9),0)*12+ROUNDUP(MONTH(E12)+DAY(E12)/30,0)),IF(MONTH(E9)>10,MONTH(E9)+2-12,MONTH(E9)+2))","v":0},{"$f":"INDEX('Work Day Calc'!$S$3:$AD$123,IF(MONTH(E9)>10,ROUNDDOWN(YEAR(F12)-YEAR(E9),0)*12+ROUNDUP(MONTH(F12)+DAY(F12)/30,0)-12,ROUNDDOWN(YEAR(F12)-YEAR(E9),0)*12+ROUNDUP(MONTH(F12)+DAY(F12)/30,0)),IF(MONTH(E9)>10,MONTH(E9)+2-12,MONTH(E9)+2))","v":0},{"$f":"INDEX('Work Day Calc'!$S$3:$AD$123,IF(MONTH(E9)>10,ROUNDDOWN(YEAR(G12)-YEAR(E9),0)*12+ROUNDUP(MONTH(G12)+DAY(G12)/30,0)-12,ROUNDDOWN(YEAR(G12)-YEAR(E9),0)*12+ROUNDUP(MONTH(G12)+DAY(G12)/30,0)),IF(MONTH(E9)>10,MONTH(E9)+2-12,MONTH(E9)+2))","v":0},null,null,null,null,null,"2005 $",1.325E-4,9.7800000000000006E-5,1.672E-4]
[null,null,null,"**Adjust \"Working Day Calc\" sheet if desired; calculation attempts to account for weather.  This is only an approximation.  Because working days are not charged in December through March, the letting date can severly affect this calculation."]
[]
{"$rows_left_out":5}
{"sheet":"Title Sheet","index":2,"n_rows":17,"n_cols":10,"rows_kept":17,"cut":false,"hidden":false,"merged":[[13,9,15,13],[16,9,23,13]]}
[]
[]
[null,null,null,null,null,null,null,null,null,"Item#:"]
[]
[null,null,null,null,null,"KTC Large Project Contract Time Determination System"]
[]
[null,"Choose Project Type:",null,null,null,null,null,null,null,"Instructions:"]
[null,null,null,null,null,null,null,null,null,"1. Fill Out Item # above."]
[null,null,null,null,null,null,null,null,null,"2. Save as Item # for Reference"]
[null,null,null,null,null,null,null,null,null,"3. Choose Project Type"]
[null,null,null,null,null,null,null,null,null,"4. Fill in Activity Fields"]
[null,null,null,null,null,null,null,null,null,"5. Save"]
[]
[null,null,null,null,null,null,null,null,null,"***Cost Indicies are updated on program initialization and valid from 2003 to current year."]
[]
{"$rows_left_out":3}
{"sheet":"Limited Access","index":3,"n_rows":19,"n_cols":7,"rows_kept":19,"cut":false,"hidden":false,"merged":[[0,0,0,5],[7,3,7,6],[13,3,14,6],[16,3,16,6],[18,3,19,6],[2,4,2,5]]}
["Limited Access Duration                   "]
["Item#               ",{"$f":"IF('Title Sheet'!$J$4=0, \"\",'Title Sheet'!$J$4)","v":""}]
["Current Year:",{"$f":"YEAR(TODAY())","v":2015},"Cost Index",{"$f":"IF(ISNA(VLOOKUP(B3,CostIndex!A:E,5,FALSE)),VLOOKUP((B3-1),CostIndex!A:E,5,FALSE),VLOOKUP(B3,CostIndex!A:E,5,FALSE))","v":{"$error":"#N/A"}},"Range"]
["Construction Type","Activity","Input Value","Mean Duration (Days)","Lower Duration (Days)","Upper Duration (Days)"]
["Limited Access (>$1 million)","Construction Estimate",null,{"$f":"ROUNDUP(145.821+0.000009493*C5*D3+0.0003552*C6+0.023*C7,0)","v":{"$error":"#N/A"}},{"$f":"ROUNDUP(75.965+0.000004393*C5*D3+0.0002281*C6+0.0044*C7,0)","v":{"$error":"#N/A"}},{"$f":"ROUNDUP(215.677+0.00001459*C5*D3+0.0004823*C6+0.0413*C7,0)","v":{"$error":"#N/A"}}]
[null,"Roadway Excv. (CY)"]
[null,"Storm Sewer (LF)"]
[null,null,null,"Schedule Estimator"]
[null,null,null,"Proposed Letting Date",{"$f":"TODAY()","v":"2015-07-22"}]
[null,null,null,null,"Lower Range","Mean","Upper Range"]
[null,null,null,"Estimated Calendar Days",{"$f":"E5","v":{"$error":"#N/A"}},{"$f":"D5","v":{"$error":"#N/A"}},{"$f":"F5","v":{"$error":"#N/A"}}]
[null,null,null,"Estimated Completion Date",{"$f":"E11+E9+'Work Day Calc'!$N$7","v":{"$error":"#N/A"}},{"$f":"F11+E9+'Work Day Calc'!$N$7","v":{"$error":"#N/A"}},{"$f":"G11+E9+'Work Day Calc'!$N$7","v":{"$error":"#N/A"}}]
[null,null,null,"Estimated Working Days**",{"$f":"INDEX('Work Day Calc'!$S$3:$AD$123,IF(MONTH(E9)>10,ROUNDDOWN(YEAR(E12)-YEAR(E9),0)*12+ROUNDUP(MONTH(E12)+DAY(E12)/30,0)-12,ROUNDDOWN(YEAR(E12)-YEAR(E9),0)*12+ROUNDUP(MONTH(E12)+DAY(E12)/30,0)),IF(MONTH(E9)>10,MONTH(E9)+2-12,MONTH(E9)+2))","v":{"$error":"#N/A"}},{"$f":"INDEX('Work Day Calc'!$S$3:$AD$123,IF(MONTH(E9)>10,ROUNDDOWN(YEAR(F12)-YEAR(E9),0)*12+ROUNDUP(MONTH(F12)+DAY(F12)/30,0)-12,ROUNDDOWN(YEAR(F12)-YEAR(E9),0)*12+ROUNDUP(MONTH(F12)+DAY(F12)/30,0)),IF(MONTH(E9)>10,MONTH(E9)+2-12,MONTH(E9)+2))","v":{"$error":"#N/A"}},{"$f":"INDEX('Work Day Calc'!$S$3:$AD$123,IF(MONTH(E9)>10,ROUNDDOWN(YEAR(G12)-YEAR(E9),0)*12+ROUNDUP(MONTH(G12)+DAY(G12)/30,0)-12,ROUNDDOWN(YEAR(G12)-YEAR(E9),0)*12+ROUNDUP(MONTH(G12)+DAY(G12)/30,0)),IF(MONTH(E9)>10,MONTH(E9)+2-12,MONTH(E9)+2))","v":{"$error":"#N/A"}}]
[null,null,null,"**Adjust \"Working Day Calc\" sheet if desired; calculation attempts to account for weather.  This is only an approximation.  Because working days are not charged in December through March, the letting date can severly affect this calculation."]
[]
{"$rows_left_out":5}
{"sheet":"Open Access","index":4,"n_rows":19,"n_cols":7,"rows_kept":19,"cut":false,"hidden":false,"merged":[[18,3,19,6],[2,4,2,5],[0,0,0,5],[7,3,7,6],[13,3,14,6],[16,3,16,6]]}
["Open Access Duration                   "]
["Item#             ",{"$f":"IF('Title Sheet'!$J$4=0, \"\",'Title Sheet'!$J$4)","v":""}]
["Current Year:",{"$f":"YEAR(TODAY())","v":2015},"Cost Index:",{"$f":"IF(ISNA(VLOOKUP(B3,CostIndex!A:E,5,FALSE)),VLOOKUP((B3-1),CostIndex!A:E,5,FALSE),VLOOKUP(B3,CostIndex!A:E,5,FALSE))","v":{"$error":"#N/A"}},"Range"]
["Construction Type","Activity","Input Value","Mean Duration (Days)","Lower Duration (Days)","Upper Duration (Days)"]
["Open Access (>$1 million)","Construction Estimate",null,{"$f":"ROUNDUP(173.6423+0.00001188*C5*D3+0.000292*C6+0.048*C7+0.006*C8+0.036*C9+0.075*C10-0.001*C11,0)","v":{"$error":"#N/A"}},{"$f":"ROUNDUP(115.429+0.000002251*C5*D3+0.0002177*C6+0.015*C7+0.004*C8+0.024*C9+0.042*C10-0.001*C11,0)","v":{"$error":"#N/A"}},{"$f":"ROUNDUP(231.855+0.0000215*C5*D3+0.0003655*C6+0.082*C7+0.009*C8+0.048*C9+0.11*C10-0.0002347*C11,0)","v":{"$error":"#N/A"}}]
[null,"Roadway Excv. (CY)"]
[null,"PVC Pipe (LF)"]
[null,"Crushed Stone Base (Ton)",null,"Schedule Estimator"]
[null,"Storm Sewer (LF)",null,"Proposed Letting Date",{"$f":"TODAY()","v":"2015-07-22"}]
[null,"Culvert Pipe (LF)",null,null,"Lower Range","Mean","Upper Range"]
[null,"Pavement Striping (LF)",null,"Estimated Calendar Days",{"$f":"E5","v":{"$error":"#N/A"}},{"$f":"D5","v":{"$error":"#N/A"}},{"$f":"F5","v":{"$error":"#N/A"}}]
[null,null,null,"Estimated Completion Date",{"$f":"E11+E9+'Work Day Calc'!$N$7","v":{"$error":"#N/A"}},{"$f":"F11+E9+'Work Day Calc'!$N$7","v":{"$error":"#N/A"}},{"$f":"G11+E9+'Work Day Calc'!$N$7","v":{"$error":"#N/A"}}]
[null,null,null,"Estimated Working Days**",{"$f":"INDEX('Work Day Calc'!$S$3:$AD$123,IF(MONTH(E9)>10,ROUNDDOWN(YEAR(E12)-YEAR(E9),0)*12+ROUNDUP(MONTH(E12)+DAY(E12)/30,0)-12,ROUNDDOWN(YEAR(E12)-YEAR(E9),0)*12+ROUNDUP(MONTH(E12)+DAY(E12)/30,0)),IF(MONTH(E9)>10,MONTH(E9)+2-12,MONTH(E9)+2))","v":{"$error":"#N/A"}},{"$f":"INDEX('Work Day Calc'!$S$3:$AD$123,IF(MONTH(E9)>10,ROUNDDOWN(YEAR(F12)-YEAR(E9),0)*12+ROUNDUP(MONTH(F12)+DAY(F12)/30,0)-12,ROUNDDOWN(YEAR(F12)-YEAR(E9),0)*12+ROUNDUP(MONTH(F12)+DAY(F12)/30,0)),IF(MONTH(E9)>10,MONTH(E9)+2-12,MONTH(E9)+2))","v":{"$error":"#N/A"}},{"$f":"INDEX('Work Day Calc'!$S$3:$AD$123,IF(MONTH(E9)>10,ROUNDDOWN(YEAR(G12)-YEAR(E9),0)*12+ROUNDUP(MONTH(G12)+DAY(G12)/30,0)-12,ROUNDDOWN(YEAR(G12)-YEAR(E9),0)*12+ROUNDUP(MONTH(G12)+DAY(G12)/30,0)),IF(MONTH(E9)>10,MONTH(E9)+2-12,MONTH(E9)+2))","v":{"$error":"#N/A"}}]
[null,null,null,"**Adjust \"Working Day Calc\" sheet if desired; calculation attempts to account for weather.  This is only an approximation.  Because working days are not charged in December through March, the letting date can severly affect this calculation."]
[]
{"$rows_left_out":5}
{"sheet":"New Route","index":5,"n_rows":19,"n_cols":7,"rows_kept":19,"cut":false,"hidden":false,"merged":[[18,3,19,6],[2,4,2,5],[0,0,0,5],[7,3,7,6],[13,3,14,6],[16,3,16,6]]}
["New Route Duration                   "]
["Item#        ",{"$f":"IF('Title Sheet'!$J$4=0, \"\",'Title Sheet'!$J$4)","v":""}]
["Current Year:",{"$f":"YEAR(TODAY())","v":2015},"Cost Index",{"$f":"IF(ISNA(VLOOKUP(B3,CostIndex!A:E,5,FALSE)),VLOOKUP((B3-1),CostIndex!A:E,5,FALSE),VLOOKUP(B3,CostIndex!A:E,5,FALSE))","v":{"$error":"#N/A"}},"Range"]
["Construction Type","Activity","Input Value","Mean Duration (Days)","Lower Duration (Days)","Upper Duration (Days)"]
["New Route (>$1 million)","Construction Estimate",null,{"$f":"ROUNDUP(39.289+0.00006894*C5*D3-0.001*C6-0.018*C7-0.01*C8-0.000451*C9,0)","v":{"$error":"#N/A"}},"n/a",{"$f":"ROUNDUP(105.728+0.00008107*C5*D3-0.0001758*C6-0.011*C7-0.004*C8-0.000002272*C9,0)","v":{"$error":"#N/A"}}]
[null,"Steel Reinforcement (LB)"]
[null,"Granular Emb (CY)"]
[null,"Perforated Pipe (LF)",null,"Schedule Estimator"]
[null,"Pavement Striping (LF)",null,"Proposed Letting Date",{"$f":"TODAY()","v":"2015-07-22"}]
[null,null,null,null,"Lower Range","Mean","Upper Range"]
[null,null,null,"Estimated Calendar Days",{"$f":"E5","v":"n/a"},{"$f":"D5","v":{"$error":"#N/A"}},{"$f":"F5","v":{"$error":"#N/A"}}]
[null,null,null,"Estimated Completion Date","n/a",{"$f":"F11+E9+'Work Day Calc'!$N$7","v":{"$error":"#N/A"}},{"$f":"G11+E9+'Work Day Calc'!$N$7","v":{"$error":"#N/A"}}]
[null,null,null,"Estimated Working Days**","n/a",{"$f":"INDEX('Work Day Calc'!$S$3:$AD$123,IF(MONTH(E9)>10,ROUNDDOWN(YEAR(F12)-YEAR(E9),0)*12+ROUNDUP(MONTH(F12)+DAY(F12)/30,0)-12,ROUNDDOWN(YEAR(F12)-YEAR(E9),0)*12+ROUNDUP(MONTH(F12)+DAY(F12)/30,0)),IF(MONTH(E9)>10,MONTH(E9)+2-12,MONTH(E9)+2))","v":{"$error":"#N/A"}},{"$f":"INDEX('Work Day Calc'!$S$3:$AD$123,IF(MONTH(E9)>10,ROUNDDOWN(YEAR(G12)-YEAR(E9),0)*12+ROUNDUP(MONTH(G12)+DAY(G12)/30,0)-12,ROUNDDOWN(YEAR(G12)-YEAR(E9),0)*12+ROUNDUP(MONTH(G12)+DAY(G12)/30,0)),IF(MONTH(E9)>10,MONTH(E9)+2-12,MONTH(E9)+2))","v":{"$error":"#N/A"}}]
[null,null,null,"**Adjust \"Working Day Calc\" sheet if desired; calculation attempts to account for weather.  This is only an approximation.  Because working days are not charged in December through March, the letting date can severly affect this calculation."]
[]
{"$rows_left_out":5}
{"sheet":"Bridge Rehabilitation","index":6,"n_rows":19,"n_cols":7,"rows_kept":19,"cut":false,"hidden":false,"merged":[[16,3,16,6],[18,3,19,6],[2,4,2,5],[0,0,0,5],[7,3,7,6],[13,3,14,6]]}
["Bridge Rehabilitation Duration                   "]
["Item#           ",{"$f":"IF('Title Sheet'!$J$4=0, \"\",'Title Sheet'!$J$4)","v":""}]
["Current Year:",{"$f":"YEAR(TODAY())","v":2015},"Cost Index",{"$f":"IF(ISNA(VLOOKUP(B3,CostIndex!A:E,5,FALSE)),VLOOKUP((B3-1),CostIndex!A:E,5,FALSE),VLOOKUP(B3,CostIndex!A:E,5,FALSE))","v":{"$error":"#N/A"}},"Range"]
["Construciton Type","Activity","Input Value","Mean Duration (Days)","Lower Duration (Days)","Upper Duration (Days)"]
["Bridge Rehabilitation","Construction Estimate",null,{"$f":"ROUNDUP(26.933+0.00005602*C5*D3,0)","v":{"$error":"#N/A"}},{"$f":"ROUNDUP(4.406+0.00004919*C5*D3,0)","v":{"$error":"#N/A"}},{"$f":"ROUNDUP(49.461+0.00006284*C5*D3,0)","v":{"$error":"#N/A"}}]
[]
[]
[null,null,null,"Schedule Estimator"]
[null,null,null,"Proposed Letting Date",{"$f":"TODAY()","v":"2015-07-22"}]
[null,null,null,null,"Lower Range","Mean","Upper Range"]
[null,null,null,"Estimated Calendar Days",{"$f":"E5","v":{"$error":"#N/A"}},{"$f":"D5","v":{"$error":"#N/A"}},{"$f":"F5","v":{"$error":"#N/A"}}]
[null,null,null,"Estimated Completion Date",{"$f":"E11+E9+'Work Day Calc'!$N$7","v":{"$error":"#N/A"}},{"$f":"F11+E9+'Work Day Calc'!$N$7","v":{"$error":"#N/A"}},{"$f":"G11+E9+'Work Day Calc'!$N$7","v":{"$error":"#N/A"}}]
[null,null,null,"Estimated Working Days**",{"$f":"INDEX('Work Day Calc'!$S$3:$AD$123,IF(MONTH(E9)>10,ROUNDDOWN(YEAR(E12)-YEAR(E9),0)*12+ROUNDUP(MONTH(E12)+DAY(E12)/30,0)-12,ROUNDDOWN(YEAR(E12)-YEAR(E9),0)*12+ROUNDUP(MONTH(E12)+DAY(E12)/30,0)),IF(MONTH(E9)>10,MONTH(E9)+2-12,MONTH(E9)+2))","v":{"$error":"#N/A"}},{"$f":"INDEX('Work Day Calc'!$S$3:$AD$123,IF(MONTH(E9)>10,ROUNDDOWN(YEAR(F12)-YEAR(E9),0)*12+ROUNDUP(MONTH(F12)+DAY(F12)/30,0)-12,ROUNDDOWN(YEAR(F12)-YEAR(E9),0)*12+ROUNDUP(MONTH(F12)+DAY(F12)/30,0)),IF(MONTH(E9)>10,MONTH(E9)+2-12,MONTH(E9)+2))","v":{"$error":"#N/A"}},{"$f":"INDEX('Work Day Calc'!$S$3:$AD$123,IF(MONTH(E9)>10,ROUNDDOWN(YEAR(G12)-YEAR(E9),0)*12+ROUNDUP(MONTH(G12)+DAY(G12)/30,0)-12,ROUNDDOWN(YEAR(G12)-YEAR(E9),0)*12+ROUNDUP(MONTH(G12)+DAY(G12)/30,0)),IF(MONTH(E9)>10,MONTH(E9)+2-12,MONTH(E9)+2))","v":{"$error":"#N/A"}}]
[null,null,null,"**Adjust \"Working Day Calc\" sheet if desired; calculation attempts to account for weather.  This is only an approximation.  Because working days are not charged in December through March, the letting date can severly affect this calculation."]
[]
{"$rows_left_out":5}
{"sheet":"Bridge Replacement","index":7,"n_rows":19,"n_cols":7,"rows_kept":19,"cut":false,"hidden":false,"merged":[[16,3,16,6],[18,3,19,6],[2,4,2,5],[0,0,0,5],[7,3,7,6],[13,3,14,6]]}
["Bridge Replacement Duration                   "]
["Item#           ",{"$f":"IF('Title Sheet'!$J$4=0, \"\",'Title Sheet'!$J$4)","v":""}]
["Current Year:",{"$f":"YEAR(TODAY())","v":2015},"Cost Index",{"$f":"IF(ISNA(VLOOKUP(B3,CostIndex!A:E,5,FALSE)),VLOOKUP((B3-1),CostIndex!A:E,5,FALSE),VLOOKUP(B3,CostIndex!A:E,5,FALSE))","v":{"$error":"#N/A"}},"Range"]
["Construction Type","Activity","Input Value","Mean Duration (Days)","Lower Duration (Days)","Upper Duration (Days)"]
["Bridge Replacement-Engineers’ Estimate (>$1 million) ","Class AA Concrete (CY)",null,{"$f":"ROUNDUP(97.155+0.447*C5+0.043*C6+0.00001909*C7*D3,0)","v":{"$error":"#N/A"}},{"$f":"ROUNDUP(22.585+0.249*C5+0.018*C6+0.000001208*C7*D3,0)","v":{"$error":"#N/A"}},{"$f":"ROUNDUP(171.725+0.644*C5+0.068*C6+0.00003696*C7*D3,0)","v":{"$error":"#N/A"}}]
[null,"Granular Emb (CY)"]
[null,"Construction Estimate"]
[null,null,null,"Schedule Estimator"]
[null,null,null,"Proposed Letting Date",{"$f":"TODAY()","v":"2015-07-22"}]
[null,null,null,null,"Lower Range","Mean","Upper Range"]
[null,null,null,"Estimated Calendar Days",{"$f":"E5","v":{"$error":"#N/A"}},{"$f":"D5","v":{"$error":"#N/A"}},{"$f":"F5","v":{"$error":"#N/A"}}]
[null,null,null,"Estimated Completion Date",{"$f":"E11+E9+'Work Day Calc'!$N$7","v":{"$error":"#N/A"}},{"$f":"F11+E9+'Work Day Calc'!$N$7","v":{"$error":"#N/A"}},{"$f":"G11+E9+'Work Day Calc'!$N$7","v":{"$error":"#N/A"}}]
[null,null,null,"Estimated Working Days**",{"$f":"INDEX('Work Day Calc'!$S$3:$AD$123,IF(MONTH(E9)>10,ROUNDDOWN(YEAR(E12)-YEAR(E9),0)*12+ROUNDUP(MONTH(E12)+DAY(E12)/30,0)-12,ROUNDDOWN(YEAR(E12)-YEAR(E9),0)*12+ROUNDUP(MONTH(E12)+DAY(E12)/30,0)),IF(MONTH(E9)>10,MONTH(E9)+2-12,MONTH(E9)+2))","v":{"$error":"#N/A"}},{"$f":"INDEX('Work Day Calc'!$S$3:$AD$123,IF(MONTH(E9)>10,ROUNDDOWN(YEAR(F12)-YEAR(E9),0)*12+ROUNDUP(MONTH(F12)+DAY(F12)/30,0)-12,ROUNDDOWN(YEAR(F12)-YEAR(E9),0)*12+ROUNDUP(MONTH(F12)+DAY(F12)/30,0)),IF(MONTH(E9)>10,MONTH(E9)+2-12,MONTH(E9)+2))","v":{"$error":"#N/A"}},{"$f":"INDEX('Work Day Calc'!$S$3:$AD$123,IF(MONTH(E9)>10,ROUNDDOWN(YEAR(G12)-YEAR(E9),0)*12+ROUNDUP(MONTH(G12)+DAY(G12)/30,0)-12,ROUNDDOWN(YEAR(G12)-YEAR(E9),0)*12+ROUNDUP(MONTH(G12)+DAY(G12)/30,0)),IF(MONTH(E9)>10,MONTH(E9)+2-12,MONTH(E9)+2))","v":{"$error":"#N/A"}}]
[null,null,null,"**Adjust \"Working Day Calc\" sheet if desired; calculation attempts to account for weather.  This is only an approximation.  Because working days are not charged in December through March, the letting date can severly affect this calculation."]
[]
{"$rows_left_out":5}
{"sheet":"Work Day Calc","index":8,"n_rows":122,"n_cols":30,"rows_kept":122,"cut":false,"hidden":false,"merged":[[0,0,0,9],[0,15,0,16]]}
["Kentucky Adjusted Working Days",null,null,null,null,null,null,null,null,null,null,null,null,null,null,"Calendar (Eqn)",null,null,"Starting Month (First Month After NTP--Approx 2 months after letting)"]
["Month","Calendar Days","Working Days Per Week","Start Working Days","Adjusted Working Days (AWD)","Spec & Weather Adjusted Working Days","  ","Rainfall Issues","Temp Issues","Adverse Days",null,null,null,null,null,"Year","Months","# WD/Mo",1,2,3,4,5,6,7,8,9,10,11,12]
["January",31,5,{"$f":"ROUND(B3/7*C3,0)","v":22},{"$f":"ROUND(B3/7*C3-J3,0)","v":11},0,null,0.2,0.3,{"$f":"D3*H3+D3*I3","v":11},null,null,null,null,null,1,1,{"$f":"F3","v":0}]
["February",28,5,{"$f":"ROUND(B4/7*C4,0)","v":20},{"$f":"ROUND(B4/7*C4-J4,0)","v":10},0,null,0.25,0.23,{"$f":"D4*H4+D4*I4","v":9.6000000000000014},null,null,null,null,null,1,2,0,{"$f":"R3","v":0}]
["March",31,5,22,13,0,null,0.33,0.08,9.0200000000000014,null,null,null,null,null,1,3,0,{"$f":"S4+$R4","v":0},{"$f":"R4","v":0}]
["April",30,5,21,15,{"$f":"Table2[[#This Row],[Adjusted Working Days (AWD)]]","v":15},null,0.3,0,6.3,null,null,"Average",null,null,1,4,15,{"$f":"S5+$R5","v":0},{"$f":"T5+$R5","v":0},{"$f":"R5","v":0}]
["May",31,6,27,19,{"$f":"Table2[[#This Row],[Adjusted Working Days (AWD)]]","v":19},null,0.28000000000000003,0,7.5600000000000005,null,null,"Days/Month",{"$f":"AVERAGE(Table2[Calendar Days])","v":30.416666666666668},null,1,5,19,{"$f":"S6+R6","v":15},15,{"$f":"U6+$R6","v":15},{"$f":"R6","v":15}]
["June",30,6,26,19,{"$f":"Table2[[#This Row],[Adjusted Working Days (AWD)]]","v":19},null,0.25,0,6.5,null,null,"WD/Month",{"$f":"AVERAGE(Table2[Start Working Days])","v":23.583333333333332},null,1,6,19,34,34,34,{"$f":"V7+$R7","v":34},{"$f":"R7","v":19}]
["July",31,6,27,20,{"$f":"Table2[[#This Row],[Adjusted Working Days (AWD)]]","v":20},null,0.23,0,6.21,null,null,"AWD/Month",{"$f":"AVERAGE(Table2[Adjusted Working Days (AWD)])","v":15.833333333333334},null,1,7,20,53,53,53,53,{"$f":"W8+$R8","v":38},{"$f":"R8","v":19}]
["August",31,6,27,20,{"$f":"Table2[[#This Row],[Adjusted Working Days (AWD)]]","v":20},null,0.23,0,6.21,null,null,null,null,null,1,8,20,73,73,73,73,58,{"$f":"X9+$R9","v":39},{"$f":"R9","v":20}]
["September",30,6,26,19,{"$f":"Table2[[#This Row],[Adjusted Working Days (AWD)]]","v":19},null,0.25,0,6.5,null,null,null,null,null,1,9,19,93,93,93,93,78,59,{"$f":"Y10+$R10","v":40},{"$f":"R10","v":20}]
["October",31,5,22,17,{"$f":"Table2[[#This Row],[Adjusted Working Days (AWD)]]","v":17},null,0.25,0,5.5,null,null,null,null,null,1,10,17,112,112,112,112,97,78,59,{"$f":"Z11+$R11","v":39},{"$f":"R11","v":19}]
["November",30,5,21,15,{"$f":"Table2[[#This Row],[Adjusted Working Days (AWD)]]","v":15},null,0.25,0.05,6.3,null,null,null,null,null,1,11,15,129,129,129,129,114,95,76,56,{"$f":"AA12+$R12","v":36},{"$f":"R12","v":17}]
["December",31,5,22,12,0,null,0.23,0.25,10.56,null,null,null,null,null,1,12,0,144,144,144,144,129,110,91,71,51,{"$f":"AB13+$R13","v":32},{"$f":"R13","v":15}]
[null,null,null,null,null,null,null,null,null,null,null,null,null,null,null,2,1,{"$f":"F3","v":0},144,144,144,144,129,110,91,71,51,32,{"$f":"AC14+$R14","v":15},{"$f":"R14","v":0}]
{"$rows_left_out":108}
{"sheet":"CostIndex","index":9,"n_rows":333,"n_cols":5,"rows_kept":333,"cut":false,"hidden":false,"merged":[]}
[]
[]
[]
[]
[]
[]
[]
[]
[]
[]
[]
[]
[]
[]
[]
{"$rows_left_out":318}