{"text_format":"1","workbook":"xlsx","n_sheets":17,"sheets":["Header","Project Items","Details","Dist_Dispute_Resolution_RawData","Dist_Dispute_Resolution_Summary","Calculations","Workbook Edits","discipline","Template XXXXXXXXX","Drop_Downs_and_Tables","t_smpl","t_cont_smpl","t_rmks_dtl","t_smpl_tst","t_smpl_tstr","t_tst_rslt_hdr","t_tst_rslt_dtl"],"not_rendered":{"charts":0,"images":5,"macros":1,"external_links":4,"defined_names":71,"comments":10,"pivot_tables":0},"unopened":[],"bounds":{"document_bytes":16777216,"sheet_cells":100000,"rows_first":2000,"rows_last":500,"rows_between":2000,"halvings":0,"cell_chars":16384,"cell_head_chars":4096},"cells_cut":0,"cells_raw":0,"read":"whole","date_system":"1900"}

{"sheet":"Header","index":0,"n_rows":22,"n_cols":22,"rows_kept":22,"cut":false,"hidden":false,"merged":[[15,3,15,20],[5,11,5,12],[6,11,6,12],[12,3,12,5],[11,11,11,13],[12,11,12,13],[4,19,4,20],[3,19,3,20],[11,3,11,5],[9,3,9,5],[6,3,6,5],[7,3,7,5]]}
["KENTUCKY TRANSPORTATION CABINET"]
["Department of Highways"]
["Division of Materials",null,null,null,null,null,null,null,null,null,null,null,null,null,null,null,null,null,null,null,null,"."]
[null,null,null,null,null,null,null,null,null,null,null,null,null,null,null,null,null,null,"Discipline","STRIPING"]
[null,null,null,null,null,null,null,null,null,null,null,null,null,null,null,null,null,null,"Version","v1.1"]
["Striping Material",null,null,null,null,null,null,null,null,null,"Material Code  ","33000"]
["Producer/Supplier Code",null,null,"Ennis",null,null,null,null,null,null,"Sample Date  "]
["Material Unit"]
[]
["Contract",null,null,"102910"]
{"$rows_left_out":13}
{"sheet":"Project Items","index":1,"n_rows":5,"n_cols":7,"rows_kept":5,"cut":false,"hidden":false,"merged":[]}
["Project","Line Item","Represented","Item",null,null,"Read-Only"]
[null,"Number","Quantity","Code",null,null,"Contractor Entries"]
[null,null,"(in item code unit)","Unit",null,null,"   (Add as many rows as required)"]
["t_cont_smpl","t_cont_smpl2","t_cont_smpl3","N/A"]
["prj_nbr","ln_itm_nbr","repr_qty","Not Stored on the SM database"]

{"sheet":"Details","index":2,"n_rows":116,"n_cols":19,"rows_kept":116,"cut":false,"hidden":false,"merged":[[43,13,43,15],[44,13,45,15],[43,7,43,9],[13,7,13,9],[14,7,14,9],[11,7,11,9],[12,7,12,9],[16,10,16,12],[13,10,13,12],[44,7,45,9],[16,13,16,15],[11,10,11,12],[11,13,11,15],[12,13,12,15],[13,13,13,15],[12,10,12,12],[14,13,14,15],[14,10,14,12],[15,7,15,9],[16,7,16,9],[15,10,15,12],[15,13,15,15],[43,10,43,12],[44,10,45,12],[15,1,15,3],[16,1,16,3],[6,4,6,6],[7,4,7,6],[8,4,8,6],[9,4,9,6],[10,4,10,6],[11,4,11,6],[11,1,11,3],[12,1,12,3],[14,4,14,6],[15,4,15,6],[16,4,16,6],[9,7,9,9],[10,7,10,9],[12,4,12,6],[13,4,13,6],[5,16,5,17],[6,1,6,3],[7,1,7,3],[8,1,8,3],[9,1,9,3],[10,1,10,3],[6,10,6,12],[7,10,7,12],[8,10,8,12],[9,10,9,12],[10,10,10,12],[10,13,10,15],[6,13,6,15],[7,13,7,15],[8,13,8,15],[9,13,9,15],[46,13,46,15],[0,0,0,18],[4,1,4,3],[4,4,4,6],[4,7,4,9],[4,10,4,12],[43,1,43,3],[43,4,43,6],[4,13,4,15],[4,16,4,17],[43,16,43,18],[22,16,22,17],[29,16,29,17],[46,16,46,18],[1,0,1,18],[44,1,45,3],[44,4,45,6],[44,16,45,18],[46,4,46,6],[13,1,13,3],[14,1,14,3],[6,7,6,9],[7,7,7,9],[8,7,8,9],[88,1,88,3],[88,4,88,6],[94,4,94,6],[94,7,94,9],[94,10,94,12],[91,1,91,3],[46,7,46,9],[46,10,46,12],[47,1,47,3],[47,4,47,6],[46,1,46,3],[47,7,47,9],[47,10,47,12],[47,13,47,15],[91,7,91,9],[91,10,91,12],[88,7,88,9],[88,10,88,12],[104,16,104,18],[94,13,94,15],[57,16,57,18],[103,16,103,18],[63,16,63,18],[56,16,56,18],[88,13,88,15],[77,16,77,18],[47,16,47,18],[58,16,60,18],[99,1,100,3],[99,4,100,6],[99,7,100,9],[99,10,100,12],[99,13,100,15],[91,4,91,6],[97,1,97,3],[97,4,97,6],[97,7,97,9],[97,10,97,12],[97,13,97,15],[91,13,91,15],[94,1,94,3]]}
["STRIPING REFLECTIVITY TEST"]
[{"$f":"VLOOKUP(Header!L6,Drop_Downs_and_Tables!A13:B18,2,FALSE)","v":"YELLOW PAINT"}]
[null,null,null,null,"DATE PAINTED:",null,null,null,"FIRST DATE TO TEST:",{"$f":"IF(F3=\"\",\"\",IF(OR(Header!L6=\"33100\",Header!L6=\"33110\"),F3+150,F3+30))","v":""},null,null,"LAST DATE TO TEST:",{"$f":"IF(F3=\"\",\"\",IF(OR(Header!L6=\"33100\",Header!L6=\"33110\"),F3+210,F3+60))","v":""}]
[]
["TEST SITE:","SEGMENT #1",null,null,"SEGMENT #2",null,null,"SEGMENT #3",null,null,"SEGMENT #4",null,null,"SEGMENT #5",null,null,"REFLECTIVITY",null,"QA "]
["ZONE:","#1","#2","#3","#1","#2","#3","#1","#2","#3","#1","#2","#3","#1","#2","#3","REQUIREMENTS",null," TEST"]
["Paint Mnf.",null,null,null,null,null,null,null,null,null,null,null,null,null,null,null,"MINIMUM:",{"$f":"IF(OR(Header!L6=\"33010\",Header!L6=\"33040\",Header!L6=\"33110\"),300,225)","v":225},"20% OF"]
["Paint Lot #"]
["Bead Mnf.",null,null,null,null,null,null,null,null,null,null,null,null,null,null,null,null,null,"DAY"]
["Bead Type",null,null,null,null,null,null,null,null,null,null,null,null,null,null,null,null,"QA MEAN:",{"$f":"IF(S24=\"\",\"\",SUM(S24:S43)/S49)","v":""}]
{"$rows_left_out":107}
{"sheet":"Dist_Dispute_Resolution_RawData","index":3,"n_rows":72,"n_cols":13,"rows_kept":72,"cut":false,"hidden":true,"merged":[[1,0,3,0],[25,0,27,0],[49,0,51,0],[26,11,26,12],[49,1,49,6],[50,1,50,2],[50,3,50,4],[50,5,50,6],[2,9,2,10],[1,7,1,12],[2,11,2,12],[25,1,25,6],[25,7,25,12],[26,1,26,2],[26,3,26,4],[26,5,26,6],[26,7,26,8],[26,9,26,10],[1,1,1,6],[2,1,2,2],[2,3,2,4],[2,5,2,6],[2,7,2,8]]}
[]
["Measurement #","Segment 1",null,null,null,null,null,"Segment 2"]
[null,"Zone  1",null,"Zone 2",null,"Zone 3",null,"Zone  1",null,"Zone 2",null,"Zone 3"]
[null,"QC","QA","QC","QA","QC","QA","QC","QA","QC","QA","QC","QA"]
[1]
[2]
[3]
[4]
[{"$f":"A8+1","v":5}]
[{"$f":"A9+1","v":6}]
{"$rows_left_out":63}
{"sheet":"Dist_Dispute_Resolution_Summary","index":4,"n_rows":62,"n_cols":19,"rows_kept":62,"cut":false,"hidden":true,"merged":[[4,1,4,3],[4,4,4,6],[4,7,4,9],[0,0,0,15],[1,0,1,15],[2,10,2,11],[2,4,2,5],[4,10,4,12],[30,10,30,12],[32,10,32,12],[4,13,4,15],[30,4,30,6],[31,4,31,6],[30,7,30,9],[31,7,31,9],[31,10,31,12],[30,13,30,15],[31,13,31,15],[32,1,32,3],[32,4,32,6],[32,13,32,15],[30,1,30,3],[31,1,31,3],[40,3,40,6],[32,7,32,9],[47,0,47,1],[34,0,34,1],[35,0,35,1],[39,0,39,1],[38,3,38,5],[39,3,39,6]]}
["DISTRICT-LEVEL DISPUTE RESOLUTION REFLECTIVITY"]
[{"$f":"VLOOKUP(Header!L6,Drop_Downs_and_Tables!A13:B18,2,FALSE)","v":"YELLOW PAINT"}]
[null,null,null,"DATE PAINTED:",{"$f":"Details!F3","v":"00:00:00"},null,null,null,null,"FIRST DATE TO TEST:",{"$f":"IF(E3=\"\",\"\",IF(OR(Header!L6=\"33100\",Header!L6=\"33110\"),E3+210,E3+60))","v":60}]
[]
["TEST SITE:","SEGMENT #1",null,null,"SEGMENT #2",null,null,"SEGMENT #3",null,null,"SEGMENT #4",null,null,"SEGMENT #5"]
["ZONE:","#1","#2","#3","#1","#2","#3","#1","#2","#3","#1","#2","#3","#1","#2","#3"]
["Paint Mnf."]
["Paint Lot #"]
["Bead Mnf."]
["Bead Type"]
{"$rows_left_out":53}
{"sheet":"Calculations","index":5,"n_rows":5,"n_cols":1,"rows_kept":5,"cut":false,"hidden":false,"merged":[]}
["Details Random Number"]
[{"$f":"RAND()*Details!D54","v":2.2773291476513111}]
[]
["District_Dispute_Resolution Random Number"]
[{"$f":"RAND()*Dist_Dispute_Resolution_Summary!M36","v":4.8964517790626383}]

{"sheet":"Workbook Edits","index":6,"n_rows":6,"n_cols":3,"rows_kept":6,"cut":false,"hidden":true,"merged":[]}
["Tracks Pre-Production Workbook Changes"]
["Date","Initials","Description"]
["2007-01-15","BGP","Working on initial version of spreadsheet."]
["2010-02-12","NJS","Updating everything per Derrick and Brandi's needs."]
["2010-03-01","NJS","New District-level dispute resolution functionality has been added."]
["2010-03-02","NJS"]

{"sheet":"discipline","index":7,"n_rows":2,"n_cols":5,"rows_kept":2,"cut":false,"hidden":true,"merged":[]}
["discipline_id","discipline_version","replace_allowed_indicator","district","Filename"]
[{"$f":"Header!T4","v":"STRIPING"},{"$f":"Header!T5","v":"v1.1"},"Y",{"$f":"Header!D13","v":""},{"$f":"Header!D12","v":0}]

{"sheet":"Template XXXXXXXXX","index":8,"n_rows":36,"n_cols":11,"rows_kept":36,"cut":false,"hidden":true,"merged":[]}
["Template:","????????",null,null,"Cell","type","label","length","English Unit",null,"SM Template Mapping"]
[null,null,null,null,"A9","Label","READING NO:","n/a","None"]
["TEST SITE:","SEGMENT #1",null,null,"B3","Alphanumeric","TEST SITE:",10,"None"]
["ZONE:","#1",null,null,"B4","Alphanumeric","ZONE:",2,"None"]
["DATE CHKD:","2005-05-23",null,null,"B5","Numeric","DATE CHKD:",8,"None"]
["COUNTY:","Warren",null,null,"B6","Alphanumeric","COUNTY:",20,"in"]
["ROUTE:",234,null,null,"B7","Alphanumeric","ROUTE:",15,"None"]
["SEGMENT MP:",8.1999999999999993,null,null,"B8","Numeric","SEGMENT MP:",3.1,"None"]
["ZONE MP:",0.4,null,null,"B9","Numeric","ZONE MP:",2.1,"%"]
["LOCATION:","NBEL",null,null,"B10","Alphanumeric","LOCATION:",3,"%"]
{"$rows_left_out":27}
{"sheet":"Drop_Downs_and_Tables","index":9,"n_rows":18,"n_cols":3,"rows_kept":18,"cut":false,"hidden":true,"merged":[]}
[]
[]
[]
[]
[]
[]
["COMP","COMPLETE"]
["FAIL","FAILED"]
["FRFP","FAILED AND REMOVED FROM PROJECT"]
[]
{"$rows_left_out":9}
{"sheet":"t_smpl","index":10,"n_rows":50,"n_cols":55,"rows_kept":50,"cut":false,"hidden":true,"merged":[]}
["Special Processing",null,null,null,"d",null,null,null,null,null,"d",null,"d",null,null,"c",null,"c",null,null,null,null,null,null,null,null,null,"c","c","c","c","c",null,"c","c","c","c",null,"c",null,"c","c",null,"c","c","c","c","c","c","c","c","c","c","c","c"]
["SM Table","t_smpl","t_smpl","t_smpl","t_smpl","t_smpl","t_smpl","t_smpl","t_smpl","t_smpl","t_smpl","t_smpl","t_smpl","t_smpl","t_smpl","t_smpl","t_smpl","t_smpl","t_smpl","t_smpl","t_smpl","t_smpl","t_smpl","t_smpl","t_smpl","t_smpl","t_smpl","t_smpl","t_smpl","t_smpl","t_smpl","t_smpl","t_smpl","t_smpl","t_smpl","t_smpl","t_smpl","t_smpl","t_smpl","t_smpl","t_smpl","t_smpl","t_smpl","t_smpl","t_smpl","t_smpl","t_smpl","t_smpl","t_smpl","t_smpl","t_smpl","t_smpl","t_smpl","t_smpl","t_smpl"]
["SM Column","smpl_id","acpt_meth_t","auth_by_cms_uid","auth_dt","cms_uid","cntrl_nbr","cntrl_t","geog_area_t","intd_use_txt","last_modfd_dt","last_modfd_uid","log_dt","matl_cd","offst","plant_id","prodr_supp_cd","rel_smpl_id","rmrks_id","smpl_dsn_t","smpl_dt","smpl_mix_id","smpl_t","smpld_by","sta","stat_t","witnes_by_cms_uid","prod_nm","plant_t","revise_smpl_id","smpl_origin","smpld_fr_txt","unt_t","mnfctr_cd","twn","buy_usa_ind","buy_usa_rqrdmt_t","repr_qty","ref","seal_nbr","smpl_sz","reqst_by_nm","std_rmrks_ind","smpl_lock_ind","dstnc_fnsh_grd","dstnc_fnsh_grd_unt","ref_doc","sz_unt_t","lock_type","locked_by","lock_dt","lev1_office_ind","lev2_office_nbr","lev3_office_nbr","lev4_office_nbr"]
["Logical Validation","No duplicates of key (highlighted in yellow);\n\nIF Sample ID \"blank\", THEN skip to next record","Existing on t_cd_tbl_dtl (cd_id)\nAND t_cd_tbl_dtl.tbl_id='ACPTMETH'","Existing on t_matl_user \nAND t_matl_user.sm_user_ind='Y'\n\nQUESTION: SHOULD WE CHECK GROUP SECURITY FOR \"AUTHORIZATION\"?",null,"Existing on t_matl_user \nAND t_matl_user.sm_user_ind='Y'",null,"Existing on t_cd_tbl_dtl (cd_id)\nAND t_cd_tbl_dtl.tbl_id='CNTRLTYP'","Existing on t_cd_tbl_dtl (cd_id)\nAND t_cd_tbl_dtl.tbl_id='GEOGAREA'",null,null,null,null,"Existing on t_matl\nAND t.matl_actvty_stat_t = \"A\"",null,null,"Existing on t_prodr_supp\nAND t_prodr_supp.actvty_stat_t = \"A\"\nAND smpl_dt (below) is between \n            t_prodr_supp_matl.effdt & exp_dt\n            (for the matl_cd above)",null,null,null,null,null,"Existing on t_cd_tbl_dtl (cd_id)\nAND t_cd_tbl_dtl.tbl_id='SMPLTYPE'","Existing on t_matl_user \nAND t_matl_user.smplr_ind='Y'",null,"Existing on t_cd_tbl_dtl (cd_id)\nAND t_cd_tbl_dtl.tbl_id='SMPLSTAT'","Existing on t_matl_user \n",null,null,null,null,null,"Existing on t_cd_tbl_dtl (cd_id)\nAND t_cd_tbl_dtl.tbl_id='UNITS'"]
["Comment","IF No Sample ID, Ignore Row.","Embed code table in spreadsheet","SM User ID from Header","Current system date","SM User ID from Header",null,null,"Derived from first two characters of Sample ID",null,"Current system date",null,"Current system date",null,"Only used for QC/QA Samples.  Otherwise, initialized to \" \" (i.e., space)","Not Used\nInitialized to \" \" (i.e., space)",null,"Not Used\nInitialized to \" \" (i.e., space)","Comes from t_rmks_dtl tab\n(Only QC & QA have active remarks - not active for INFO Samples currently)",null,null,null,"Embed code table in spreadsheet","Sampler ID","Only used for QC/QA Samples.  Otherwise, initialized to \" \" (i.e., space)",null,null,"Not Used\nInitialized to \" \" (i.e., space)","Not Used\nInitialized to \" \" (i.e., space)","Not Used\nInitialized to \" \" (i.e., space)","Not Used\nInitialized to \" \" (i.e., space)","Not Used\nInitialized to \" \" (i.e., space)",null,"Not Used\nInitialized to \" \" (i.e., space)","Not Used\nInitialized to \" \" (i.e., space)","Not Used\nInitialized to \" \" (i.e., space)","Not Used\nInitialized to \" \" (i.e., space)",null,"Not Used\nInitialized to \" \" (i.e., space)","Not Used for Start Up\nInitialized to \" \" (i.e., space)\nUsed for remaining.","Not Used\nInitialized to \" \" (i.e., space)","Not Used\nInitialized to \" \" (i.e., space)","Set Only for QC Samples\nInitialized to \"N\" otherwise","Not Used\nInitialized to \" \" (i.e., space)","Not Used\nInitialized to \" \" (i.e., space)","Not Used\nInitialized to \" \" (i.e., space)","Not Used\nInitialized to \" \" (i.e., space)","Not Used\nInitialized to \" \" (i.e., space)","Not Used\nInitialized to \" \" (i.e., space)","Not Used\nInitialized to \" \" (i.e., space)","Not Used\nInitialized to \"\" (i.e., NULL)","Not Used\nInitialized to \" \" (i.e., space)","Not Used\nInitialized to \" \" (i.e., space)","Not Used\nInitialized to \" \" (i.e., space)","Not Used\nInitialized to \" \" (i.e., space)"]
["Long Description","SiteManager \nSample ID ","Acceptance Method","Authorizer SM User ID","Authorization Date","Sample \"Creator\" \nSM User ID","Control Number","Control Type","Geographic Area","Intended Use (of material sampled)","Last Modified Date","Last Modified User ID","Sample Logged Date","Material Code","Offset","Plant ID","Producer / Supplier","Related Sample ID","Remarks ID","Mix Design Type","Sample Date","Mix ID","Sample Type","Sampling Technician (SM User ID)","Station","Sample Status","Sampling KYTC Witness SM User ID ","Product Name","Plant Type","Revised Sample ID","Sample Origin","Sample From","Repr Material Quantity Units","Manufacturer","Town (where sampled)","Buy USA Indicator","Buy USA Requirement Type","Represented Material Quantity","Reference","Sublot Sample","Sample Size","Name of Sample Requester","Standard Remarks Included Indicator","Sample Locked Indicator","Distance From Finished Grade","Distance From Finished Grade Unit","Reference Document","Sample Size Unit","Sample Lock Type","Sample Locked By (SM User ID)","Sample Lock Date","Sample Lock Level 1 Office","Sample Lock Level 2 Office","Sample Lock Level 3 Office","Sample Lock Level 4 Office"]
["User Entry                                     XML Schema \nSheet Map                                   Column Name","smpl_id","acpt_meth_t","auth_by_cms_uid","auth_dt","cms_uid","cntrl_nbr","cntrl_t","geog_area_t","intd_use_txt","last_modfd_dt","last_modfd_uid","log_dt","matl_cd","offst","plant_id","prodr_supp_cd","rel_smpl_id","rmrks_id","smpl_dsn_t","smpl_dt","smpl_mix_id","smpl_t","smpld_by","sta","stat_t","witnes_by_cms_uid","prod_nm","plant_t","revise_smpl_id","smpl_origin","smpld_fr_txt","unt_t","mnfctr_cd","twn","buy_usa_ind","buy_usa_rqrdmt_t","repr_qty","ref","seal_nbr","smpl_sz","reqst_by_nm","std_rmrks_ind","smpl_lock_ind","dstnc_fnsh_grd","dstnc_fnsh_grd_unt","ref_doc","sz_unt_t","lock_type","locked_by","lock_dt","lev1_office_ind","lev2_office_nbr","lev3_office_nbr","lev4_office_nbr"]
["SU1",null,"TR",null,null,null,null,"LNBR",null,null,null,null,null,null," "," ",null," ",null,"PCC",null,null,null,null," ",null,null," "," "," "," "," ",null," "," "," "," ",null," "," "," "," ",{"$f":"IF(W8=\"QC\",\"Y\",\"N\")","v":"N"}," "," "," "," "," "," "," ",null," "," "," "," "]
[null,null,"TR",null,null,null,null,"LNBR",null,null,null,null,null,null," "," ",null," ",null,"PCC",null,null,null,null," ",null,null," "," "," "," "," ",null," "," "," "," ",null," "," "," "," ","N"," "," "," "," "," "," "," ",null," "," "," "," "]
[null,null,"TR",null,null,null,null,"LNBR",null,null,null,null,null,null," "," ",null," ",null,"PCC",null,null,null,null," ",null,null," "," "," "," "," ",null," "," "," "," ",null," "," "," "," ","N"," "," "," "," "," "," "," ",null," "," "," "," "]
{"$rows_left_out":41}
{"sheet":"t_cont_smpl","index":11,"n_rows":50,"n_cols":11,"rows_kept":50,"cut":false,"hidden":true,"merged":[[3,2,3,4],[3,10,3,12]]}
["Special Processing","x",null,null,null,null,null,"d"]
["SM Table","t_cont_smpl","t_cont_smpl","t_cont_smpl","t_cont_smpl","t_cont_smpl","t_cont_smpl","t_cont_smpl"]
["SM Column","smpl_id","cont_id","prj_nbr","ln_itm_nbr","repr_qty","last_modfd_uid","last_modfd_dt"]
["Logical Validation","No duplicates of key (highlighted in yellow);\n\nIF Sample ID \"blank\", THEN skip to next record","These three keys (and matl_cd from Header tab) must exist on t_cont_streq_matl.",null,null,"IF t_smpl.smpl_t = \"QC\" THEN\n   t_cont_smpl.repr_qty = \n            User Entered \"Represent Quantity\" / J4\nELSE\n   just use User Entered \"Represented Quantity\"\nENDIF\n     ",null,null,null,{"$f":"43-COUNTBLANK(t_smpl!B8:B50)","v":0},"NUMBER OF QC SAMPLES"]
["Comment","IF No Sample ID, Ignore Row.",null,"THESE THREE FIELDS COME FROM THE FIRST THREE COLUMNS ON THE \"Project Item\" TAB \n(AND EACH ROW ON THAT TAB REPEATS FOR EVERY ROW ON THIS TAB HAVING A \"Sample ID\")",null,null,null,"Current system date"]
["Long Description","SiteManager \nSample ID ","Contract ID","Project Number","Line Item Number","Represented Quantity","Last Modified User ID","Last Modified Date"]
["User Entry                                     XML Schema \nSheet Map                                   Column Name","smpl_id","cont_id","prj_nbr","ln_itm_nbr","repr_qty","last_modfd_uid","last_modfd_dt"]
["SU1",null,null,"N/A","N/A","N/A"]
[null,null,null,"N/A","N/A","N/A"]
[null,null,null,"N/A","N/A","N/A"]
{"$rows_left_out":41}
{"sheet":"t_rmks_dtl","index":12,"n_rows":50,"n_cols":7,"rows_kept":50,"cut":false,"hidden":true,"merged":[]}
["Special Processing",null,null,null,null,null,"d"]
["SM Table","t_rmrks_dtl","t_rmrks_dtl","t_rmrks_dtl","t_rmrks_dtl","t_rmrks_dtl","t_rmrks_dtl"]
["SM Column","rmrks_id","rmrks_t","rmrks_sn","rmrks_txt_fld","last_modfd_uid","last_modfd_dt"]
["Logical Validation","No duplicates of key (highlighted in yellow);\n\nIF Sample ID \"blank\", THEN skip to next record"]
["Comment","IF No Sample ID, Ignore Row.",null,null,"Up to 254 char Sample Remark  \n(NOTE: COULD HAVE REMARK FOR EACH TEST.)",null,"Current system date"]
["Long Description","Remark ID","Remark Type","Remark Sequence Number","Remarks","Last Modified User ID","Last Modified Date"]
["User Entry                                     XML Schema \nSheet Map                                   Column Name","rmrks_id","rmrks_t","rmrks_sn","rmrks_txt_fld","last_modfd_uid","last_modfd_dt"]
["SU1",null,"GEN",1]
[null,null,"GEN",1]
[null,null,"GEN",1]
{"$rows_left_out":41}
{"sheet":"t_smpl_tst","index":13,"n_rows":59,"n_cols":11,"rows_kept":59,"cut":false,"hidden":true,"merged":[]}
["Special Processing",null,null,null,"c","c",null,null,null,null,"d"]
["SM Table","t_smpl_tst","t_smpl_tst","t_smpl_tst","t_smpl_tst","t_smpl_tst","t_smpl_tst","t_smpl_tst","t_smpl_tst","t_smpl_tst","t_smpl_tst"]
["SM Column","smpl_id","tst_meth","smpl_tst_nbr","lab_id","chrg_amt","strt_dt","est_cmpl_dt","actl_cmpl_dt","last_modfd_uid","last_modfd_dt"]
["Logical Validation","No duplicates of key (highlighted in yellow);\n\nIF Sample ID \"blank\", THEN skip to next record","Existing on t_tst_fee_schd"]
["Comment","IF No Sample ID, Ignore Row.",null,null,"Not Used\nInitialized to \" \" (i.e., space)","Not Used\nInitialized to 0",null,null,null,null,"Current system date"]
["Long Description","SiteManager \nSample ID ","Test Method","Test Number","SM Laboratory ID","Charge Amount","Received Date","Actual Start Date","Actual Completion Date","Last Modified User ID","Last Modified Date"]
["User Entry                                     XML Schema \nSheet Map                                   Column Name","smpl_id","tst_meth","smpl_tst_nbr","lab_id","chrg_amt","strt_dt","est_cmpl_dt","actl_cmpl_dt","last_modfd_uid","last_modfd_dt"]
["SU1",null,"COCONCPLAS",1," ",0]
[null,null,"COCONCPLAS",1," ",0]
[null,null,"COCONCPLAS",1," ",0]
{"$rows_left_out":50}
{"sheet":"t_smpl_tstr","index":14,"n_rows":164,"n_cols":7,"rows_kept":164,"cut":false,"hidden":true,"merged":[]}
["Special Processing",null,null,null,null,null,"d"]
["SM Table","t_smpl_tstr","t_smpl_tstr","t_smpl_tstr","t_smpl_tstr","t_smpl_tstr","t_smpl_tstr"]
["SM Column","smpl_id","tst_meth","smpl_tst_nbr","tst_id","last_modfd_uid","last_modfd_dt"]
["Logical Validation","A DUPLICATE OF KEY (highlighted in yellow) IS NOT AN ERROR IN THIS CASE. (Just removed duplicates prior to writing to DB)\n\nIF \"blank\", THEN skip to next record\n\n","Existing on t_tst_fee_schd",null,"Existing on t_matl_user \nAND  t_matl_user.tstr_ind='Y\"\nAND  active test qualification of \"GRADING TECHNICIAN LEVEL I\" \n        (  I.e., At least one row returned from:\n         SELECT * FROM t_tst_prsnl_qualfn\n         WHERE tst_id = tst_id\n         AND      tst_prsnlqualfn_t = \"GDNS\"\n         AND      qualfn_lev_t = \"GRT1\"\n         AND      exp_dt >= t_smpl_tst.strt_dt (same keys as current row)\n         AND      effdt     <= t_smpl_tst.strt_dt (same keys as current row)\n\n         For any row above, return at least one row:\n         SELECT * FROM t_tst_prsnqualftst\n         WHERE tst_id = tst_id\n         AND      tst_prsnlqualfn_t = t_tst_prsnl_qualfn.tst_prsnlqualfn_t\n         AND      qualfn_lev_t = t_tst_prsnl_qualfn.qualfn_lev_t\n         AND      effdt = t_tst_prsnl_qualfn.effdt\n         AND      tst_meth = t_smpl_tst.tst_meth   )"]
["Comment","IF No Sample ID, Ignore Row.",null,null,"The Tester must have active “GRADING TECHNICIAN LEVEL I” Tester qualification for a Material Category of “GEOTECH DENSITY”.",null,"Current system date"]
["Long Description","SiteManager \nSample ID","Test Method","Test Number","Tester ID","Last Modified User ID","Last Modified Date"]
["User Entry                                     XML Schema \nSheet Map                                   Column Name","smpl_id","tst_meth","smpl_tst_nbr","tst_id","last_modfd_uid","last_modfd_dt"]
["SU1 Slump",null,"COCONCPLAS",1]
[null,null,"COCONCPLAS",1]
[null,null,"COCONCPLAS",1]
{"$rows_left_out":155}
{"sheet":"t_tst_rslt_hdr","index":15,"n_rows":59,"n_cols":8,"rows_kept":59,"cut":false,"hidden":true,"merged":[]}
["Special Processing",null,null,null,"c","c","d"]
["SM Table","t_tst_rslt_hdr","t_tst_rslt_hdr","t_tst_rslt_hdr","t_tst_rslt_hdr","t_tst_rslt_hdr","t_tst_rslt_hdr","t_tst_rslt_hdr"]
["SM Column","smpl_id","tst_meth","smpl_tst_nbr","rmrks_id","effdt","last_modfd_dt","last_modfd_uid"]
["Logical Validation","No duplicates of key (highlighted in yellow);\n\nIF Sample ID \"blank\", THEN skip to next record"]
["Comment","IF No Sample ID, Ignore Row.",null,null,"Not Used\nInitialized to \" \" (i.e., space)","Test Specification Date (Not used in this discipline)\nInitialized to null (0 on SM DB)","Current system date"]
["Long Description","Sample ID","Test Method","Test Number","Remarks ID","Effective Date","Last Modified Date","Last Modified User ID"]
["User Entry                                     XML Schema \nSheet Map                                   Column Name","smpl_id","tst_meth","smpl_tst_nbr","rmrks_id","effdt","last_modfd_dt","last_modfd_uid"]
["SU1",null,"COCONCPLAS",1," "]
[null,null,"COCONCPLAS",1," "]
[null,null,"COCONCPLAS",1," "]
{"$rows_left_out":50}
{"sheet":"t_tst_rslt_dtl","index":16,"n_rows":1289,"n_cols":9,"rows_kept":1289,"cut":false,"hidden":true,"merged":[]}
["Special Processing",null,null,null,null,null,null,null,"d"]
["SM Table","t_tst_rslt_dtl","t_tst_rslt_dtl","t_tst_rslt_dtl","t_tst_rslt_dtl","t_tst_rslt_dtl","t_tst_rslt_dtl","t_tst_rslt_dtl","t_tst_rslt_dtl"]
["SM Column","smpl_id","tst_meth","smpl_tst_nbr","tst_fld_sn","tst_strg_fld_val","tst_numrc_fld_val","last_modfd_uid","last_modfd_dt"]
["Logical Validation","No duplicates of key (highlighted in yellow);\n\nIF Sample ID \"blank\", THEN skip to next record",null,null,null,"Type & Size   AND\nCHOOSE CASE tst_fld_sn\n      CASE \"SequenceNumber\"\n            <Edit Goes Here>\n      ENDCASE","Type & Size   AND\nCHOOSE CASE tst_fld_sn\n      CASE \"SequenceNumber\"\n            <Edit Goes Here>\n      ENDCASE"]
["Comment","IF No Sample ID, Ignore Row.",null,null,null,"IF Not Used,\nInitialize to \" \" \n(i.e., space)","IF Not Used\nInitialize to 0",null,"Current system date"]
["Long Description","Sample ID","Test Method","Test Number","Test Field Sequence Number","Test Field String Value","Test Field Numeric Value","Last Modified User ID","Last Modified Date"]
["User Entry                                     XML Schema \nSheet Map                                   Column Name","smpl_id","tst_meth","smpl_tst_nbr","tst_fld_sn","tst_strg_fld_val","tst_numrc_fld_val","last_modfd_uid","last_modfd_dt"]
["SU1 - Comment  (NOT CURRENTLY USED)",null,"COCONCPLAS",1,1,null,0]
[null,null,"COCONCPLAS",1,1,null,0]
[null,null,"COCONCPLAS",1,1,null,0]
{"$rows_left_out":1279}