{"text_format":"1","workbook":"xlsx","n_sheets":28,"sheets":["Design Data","Rand. #'s (cont.)","Polish-Resistant Data","Recycle Data","Project Items","1-Pt. Check","Graphs","0.45 Power Chart","0.45 Power Chart-Master Range","TSR","Performance Specimens","KYCT Data","Hamburg Data","Error","Chart Data","Workbook Edits","discipline","AMMIXPACK","t_smpl","t_cont_smpl","t_rmks_dtl","t_smpl_tst","t_smpl_tstr","t_tst_rslt_hdr","t_tst_rslt_dtl","t_superpave","t_bit_conc_mixblnd","RndGenerator"],"not_rendered":{"charts":13,"images":29,"macros":1,"external_links":6,"defined_names":202,"comments":12,"pivot_tables":0},"unopened":[{"sheet":"0.45 Power Chart","index":7,"reason":"not_a_worksheet"},{"sheet":"0.45 Power Chart-Master Range","index":8,"reason":"not_a_worksheet"},{"sheet":"RndGenerator","index":27,"reason":"part_missing"}],"bounds":{"document_bytes":16777216,"sheet_cells":100000,"rows_first":2000,"rows_last":500,"rows_between":2000,"halvings":0,"cell_chars":16384,"cell_head_chars":4096},"cells_cut":0,"cells_raw":0,"read":"whole","date_system":"1900"}

{"sheet":"Design Data","index":0,"n_rows":127,"n_cols":24,"rows_kept":127,"cut":false,"hidden":false,"merged":[[23,25,23,27],[27,25,27,27],[29,25,29,27],[25,25,25,27],[113,13,113,15],[114,13,114,15],[110,0,110,15],[23,2,23,6],[114,0,114,1],[40,19,40,20],[98,15,98,17],[99,11,99,14],[99,15,99,17],[100,11,100,14],[100,15,100,17],[111,13,111,15],[112,13,112,15],[114,7,114,8],[114,9,114,10],[38,17,38,18],[35,19,35,20],[40,17,40,18],[41,19,41,20],[38,19,38,20],[124,13,124,15],[125,13,125,15],[126,13,126,15],[117,13,117,15],[120,13,120,15],[121,13,121,15],[122,13,122,15],[123,13,123,15],[119,9,119,15],[120,9,120,11],[122,9,122,11],[124,9,124,11],[125,9,125,11],[126,9,126,11],[123,9,123,11],[121,9,121,11],[116,13,116,15],[117,9,117,10],[116,0,116,1],[116,2,116,6],[116,7,116,8],[116,9,116,10],[117,0,117,1],[117,2,117,6],[117,7,117,8],[115,0,115,1],[115,2,115,6],[115,7,115,8],[115,9,115,10],[114,2,114,6],[97,11,97,17],[98,11,98,14],[115,13,115,15],[6,14,6,20],[34,17,34,18],[23,7,23,8],[24,7,24,8],[26,7,26,8],[28,19,28,20],[32,19,32,20],[22,7,22,8],[9,10,9,11],[34,19,34,20],[15,10,15,11],[19,10,19,11],[53,19,53,20],[57,18,57,20],[55,15,55,16],[41,17,41,18],[120,0,126,7],[119,0,119,7],[81,18,81,20],[74,14,74,16],[112,0,112,1],[51,19,51,20],[9,2,9,3],[22,0,22,1],[75,12,76,16],[24,0,24,1],[25,0,25,1],[13,2,13,4],[14,2,14,4],[11,2,11,4],[12,2,12,4],[26,0,26,1],[22,2,22,6],[113,0,113,1],[113,2,113,6],[113,7,113,8],[113,9,113,10],[112,7,112,8],[112,9,112,10],[112,2,112,6],[27,0,27,1],[25,2,25,6],[26,2,26,6],[23,0,23,1],[23,9,23,10],[24,9,24,10],[25,9,25,10],[24,2,24,6],[52,19,52,20],[25,7,25,8],[31,17,31,18],[31,19,31,20],[26,13,26,14],[27,2,27,6],[37,19,37,20],[28,16,28,18],[37,17,37,18],[27,7,27,8],[27,9,27,10],[35,17,35,18],[26,9,26,10],[95,11,95,14],[93,15,93,17],[94,15,94,17],[95,15,95,17],[17,10,17,11],[32,17,32,18],[18,10,18,11],[7,10,7,11],[92,11,92,17],[93,11,93,14],[94,11,94,14],[22,9,22,10]]}
[]
[null,null,null,null,null,null,null,null,null,null,null,null,null,null,null,null,null,null,null,null,"October 2022"]
["Kentucky Transportation Cabinet, Department of Highways, Division of Materials",null,null,null,null,null,null,null,null,null,null,null,null,null,null,null,null,null,null,null,"Ver 11.3"]
["Asphalt Mixtures Testing Section"]
["1227 Wilkinson Boulevard, Frankfort, KY  40601-1226"]
[]
[null,null,null,null,"Asphalt-Mixture-Design Results",null,null,null,null,null,null,null,null,null,{"$f":"IF('Chart Data'!W14=\"Bid Item Not In Drop-Down List\",CONCATENATE('Chart Data'!W19,\" \",'Chart Data'!W20,\" \",'Chart Data'!W21,\" \",'Chart Data'!W22,'Chart Data'!W23,\" \",'Chart Data'!W24),\"\")","v":""}]
["CONTRACT ID:",null,null,null,null,"LETTING DATE:",null,null,"CONTACT PHONE:",null,null,null,null,"TYPE OF MIX:",{"$f":"'Chart Data'!W14","v":""}]
[null,null," "]
["SM ID NUM.:",null,null,null,null,"MIX ID NUM.:",null,null,"COUNTY:",null,null,null,null,null,"SUBMITTAL TYPE:",null,null,{"$f":"'Chart Data'!J7","v":""}]
[null,null," ",null,null,null,null," "]
["FED/STATE #:",null,null,null,null,"LAB UNIT:",null,null,"TEST METHOD:",null,"AASHTO M323 & R35",null,null,null,"TOTAL TONS:",null,null,null,null,"GRADATION:"]
[null,null,null,null,null,null,null,null,null,null,null,null,null,null,"(must equal sum on Project Items tab)"]
["PROJ. (ITEM):",null,{"$f":"IF('Project Items'!A6=\"\",\"Enter Project(s) & Line Item(s)\",IF('Project Items'!A8=\"\",CONCATENATE('Project Items'!A6,\" (\",'Project Items'!B6,\")\"),\"Multiple Projects Selected\"))","v":"Enter Project(s) & Line Item(s)"},null,null,"DATE REC.:",null,null,"CNTR. & LOC.:",null,null,null,null,null,"CNTR. PROD. #:",null,{"$f":"IF('Chart Data'!AO2=\"\",\"\",'Chart Data'!AO2)","v":{"$error":"#N/A"}},null,"Sieve","JMF","\"WeighUp\""]
[null,null,{"$f":"IF('Project Items'!A6=\"\",\"On 'Project Items' Tab.\",IF('Project Items'!A7=\"\",\"\",IF('Project Items'!A8=\"\",CONCATENATE('Project Items'!A7,\" (\",'Project Items'!B7,\")\"),\"See 'Project Items' Tab.\")))","v":"On 'Project Items' Tab."},null,null,null,null,null,{"$f":"IF(ISERROR(VLOOKUP(Q14,'Chart Data'!AM1:AN136,2,FALSE)),\"\",VLOOKUP(Q14,'Chart Data'!AM1:AN136,2,FALSE))","v":""},null,null,null,null,null,null,null,null,null,"2 \"",100,100]
["BINDER SOURCE & LOC.",null,null,null,null,"DATE REL.:",null,null,"SUBMITTED BY:",null,null,null,null,null,"MIX MAT. CODE:",null,{"$f":"'Chart Data'!H48","v":""},null,"1 1/2 \""]
[{"$f":"IF(ISERROR(VLOOKUP(H18,'Chart Data'!AH1:AI35,2,FALSE)),\"\",VLOOKUP(H18,'Chart Data'!AH1:AI35,2,FALSE))","v":""},null,null,null,null,null,null,null,null,null,null,null,null,null,null,null,null,null,"1 \""]
["BINDER GRADE:",null,{"$f":"'Chart Data'!W15","v":""},null,null,"BIND. PROD. #:",null,{"$f":"IF('Chart Data'!AJ2=\"\",\"\",'Chart Data'!AJ2)","v":""},"MIX/COMP TEMP:",null,{"$f":"IF('Chart Data'!H48=\"\",\"\",IF('Chart Data'!H48=20025,\"240 (deg. F)\",IF('Chart Data'!K38=TRUE,VLOOKUP('Chart Data'!F48,'Chart Data'!J39:K40,2,FALSE),(IF(ISERROR(VLOOKUP('Chart Data'!F48,'Chart Data'!J28:K31,2,FALSE)),\"See Applicable Spec.\",VLOOKUP('Chart Data'!F48,'Chart Data'!J28:K31,2,FALSE))))))","v":""},null,null,null,null,null,null,null,"3/4 \""]
[{"$f":"IF(AND('Chart Data'!W55>0,'Chart Data'!BK9=\"NO\"),'Chart Data'!T42,IF('Chart Data'!W55>0,\"Recycle selected:  Use \" & 'Chart Data'!BK10 & \" virgin binder.\",\"(as specified in Bid Item)\"))","v":"(as specified in Bid Item)"},null,null,null,null,"Corr. Factor:",null,null,"Serial Number:",null,null,null,null,null,null,null,null,null,"1/2 \""]
["BINDER CODE:",null,{"$f":"IF(ISERROR('Chart Data'!Y2),\"\",'Chart Data'!Y2)","v":""},null,null,"ESAL CLASS:",null,{"$f":"IF(ISERROR('Chart Data'!W16),\"\",'Chart Data'!W16)","v":""},"DEPTH (mm):",null,null,null,null,null,null,null,null,null,"3/8 \""]
[{"$f":"IF('Chart Data'!L47=\"\",\"\",IF(OR('Chart Data'!L47=\"A\",'Chart Data'!L47=\"B\"),\"Please Indicate Polish-Resistant Source(s) by Checkboxes   ↓\",\"\"))","v":""},null,null,null,null,null,null,null,{"$f":"IF(AND(F21=\"\",K20=\"\"),\"(Enter depth from surface (mm))\",\"\")","v":"(Enter depth from surface (mm))"},null,null,null,null,null,null,null,null,null,"1/4 \"","N / A","N / A"]
["AGG. PROD. NO.",null,"PRODUCER NAME",null,null,null,null,"MAT. CODE ",null,"AGG. TYPE",null,"Gsb","%","Gravity Info.",null,null,"Max. Specific",null,"#4"]
[null,null,null,null,null,null,null,{"$f":"IF(J23=\"\",\"\",VALUE(VLOOKUP(J23,'Chart Data'!$AR$1:$AS$137,2,FALSE)))","v":""},null,null,null,null,null,"Gsb    =",{"$f":"IF(I95=\"\",\"\",(1/I95*100))","v":""},null,"Gravity Info.",null,"#8"]
[null,null,null,null,null,null,null,{"$f":"IF(J24=\"\",\"\",VALUE(VLOOKUP(J24,'Chart Data'!$AR$1:$AS$137,2,FALSE)))","v":""},null,null,null,null,null,"Gse    =",{"$f":"IF(Q25=\"\",\"\",(100-Q25)/((100/R28)-(Q25/O25)))","v":""},null,"%AC","MSG's","#16"]
[null,null,null,null,null,null,null,{"$f":"IF(J25=\"\",\"\",VALUE(VLOOKUP(J25,'Chart Data'!$AR$1:$AS$137,2,FALSE)))","v":""},null,null,null,null,null,"Gb     =",1.03,null,null,null,"#30"]
[null,null,null,null,null,null,null,{"$f":"IF(J26=\"\",\"\",VALUE(VLOOKUP(J26,'Chart Data'!$AR$1:$AS$137,2,FALSE)))","v":""},null,null,null,null,null,{"$f":"IF('Chart Data'!S55=\"Recycle\",\"Recycle MSG\",\"\")","v":""},null,null,null,null,"#50"]
[null,null,null,null,null,null,null,{"$f":"IF(J27=\"\",\"\",VALUE(VLOOKUP(J27,'Chart Data'!$AR$1:$AS$137,2,FALSE)))","v":""},null,null,null,null,null,{"$f":"'Chart Data'!R105","v":""},null,null," ",null,"#100"]
[null,null,null,null,null,null,null,{"$f":"IF(J28=\"\",\"\",VALUE(VLOOKUP(J28,'Chart Data'!$AR$1:$AS$137,2,FALSE)))","v":""},null,null,null,null,null,{"$f":"IF('Chart Data'!S55=\"Recycle\",\"Rap Gsb =\",\"\")","v":""},{"$f":"'Chart Data'!R111","v":""},{"$f":"IF(AND(N27=\"\",O27=\"\"),\"\",AVERAGE(N27:O27))","v":""},"Average:",{"$f":"IF(Q25=\"\",\"\",AVERAGE(R25:R27))","v":""},"#200"]
[null,null,null,null,null,null,null,null,{"$f":"IF('Chart Data'!S55=\"Recycle\",\"Fill in Recycle Info. on 'Recycle Data' sheet and the Backcalculated Gsb will be automatically utilized for the Agg. Gravity for Recycle.\",\"\")","v":""}]
["Sample #","% AC",null,"Weight (g)",null,"Bulk Vol.","BSG","Unit Wt. @","Max Spec","% Voids","% Abs. AC","% Eff. AC","% VMA","% VFA","Film Th.","%Gmm","D/A","Height",null,"Height"]
[null,"(Mix)","(Air)","(Water)","(SSD)","(g)","@ Ndes","Ndes (pcf)","Gravity","@ Ndes","(Mix)",null,"@ Ndes","@ Ndes","(µm)","@ Nini","Ratio","@ Nini (mm)",null,"@ Ndes (mm)"]
[1," ",null,null,null,{"$f":"IF(E32=\"\",\"\",E32-D32)","v":""},{"$f":"IF(ISERROR(C32/F32),\"\",(C32/F32))","v":""},{"$f":"IF(ISERROR(G32*62.4),\"\",(G32*62.4))","v":""},null,null,null,null,null,null,null,{"$f":"IF(OR(R32=\"\",T32=\"\"),\"\",((C32/F32)*(T32/R32))*100/I34)","v":""}]
[2,null,null,null,null,{"$f":"IF(E33=\"\",\"\",E33-D33)","v":""},"",{"$f":"IF(ISERROR(G33*62.4),\"\",(G33*62.4))","v":""},null,null,null,null,null,null,null,{"$f":"IF(R33=\"\",\"\",((C33/F33)*(T33/R33))*100/I34)","v":""}]
["Average",null,null,null," ",null,{"$f":"IF(G32=\"\",\"\",AVERAGE(G32:G33))","v":""},{"$f":"IF(H32=\"\",\"\",AVERAGE(H32:H33))","v":""},{"$f":"IF(B34=\"\",\"\",100/((B34/1.03)+((100-B34)/$O$24)))","v":""},{"$f":"IF(I34=\"\",\"\",((I34-G34)/I34)*100)","v":""},{"$f":"IF(B34=\"\",\"\",($O$24-$O$23)/($O$24*$O$23)*$O$25*(100-B34))","v":""},{"$f":"IF(B34=\"\",\"\",(B34-K34))","v":""},{"$f":"IF(B34=\"\",\"\",100-(G34*(100-B34)/$O$23))","v":""},{"$f":"IF(M34=\"\",\"\",(100*(M34-J34)/M34))","v":""},{"$f":"IF(L34=\"\",\"\",(10*((L34/100)/($H$98*(1-L34/100))/0.00003937)+0.5)/10)","v":""},{"$f":"IF(P32=\"\",\"\",AVERAGE(P32:P33))","v":""},{"$f":"IF($L$34=\"\",\"\",($T$28/L34))","v":""}]
[3,"% AC",null,null,null,{"$f":"IF(E35=\"\",\"\",E35-D35)","v":""},"",{"$f":"IF(ISERROR(G35*62.4),\"\",(G35*62.4))","v":""},null,null,null,null,null,null,null,{"$f":"IF(R35=\"\",\"\",((C35/F35)*(T35/R35))*100/I37)","v":""}]
[4,null,null,null,null,{"$f":"IF(E36=\"\",\"\",E36-D36)","v":""},"",{"$f":"IF(ISERROR(G36*62.4),\"\",(G36*62.4))","v":""},null,null,null,null,null,null,null,{"$f":"IF(R36=\"\",\"\",((C36/F36)*(T36/R36))*100/I37)","v":""}]
["Average",null,null," ",null,null,{"$f":"IF(G35=\"\",\"\",AVERAGE(G35:G36))","v":""},{"$f":"IF(H35=\"\",\"\",AVERAGE(H35:H36))","v":""},{"$f":"IF(B37=\"\",\"\",100/((B37/1.03)+((100-B37)/$O$24)))","v":""},{"$f":"IF(I37=\"\",\"\",((I37-G37)/I37)*100)","v":""},{"$f":"IF(B37=\"\",\"\",($O$24-$O$23)/($O$24*$O$23)*$O$25*(100-B37))","v":""},{"$f":"IF(B37=\"\",\"\",(B37-K37))","v":""},{"$f":"IF(B37=\"\",\"\",100-(G37*(100-B37)/$O$23))","v":""},{"$f":"IF(M37=\"\",\"\",(100*(M37-J37)/M37))","v":""},{"$f":"IF(L37=\"\",\"\",(10*((L37/100)/($H$98*(1-L37/100))/0.00003937)+0.5)/10)","v":""},{"$f":"IF(P35=\"\",\"\",AVERAGE(P35:P36))","v":""},{"$f":"IF($L$37=\"\",\"\",($T$28/L37))","v":""}]
[5,"% AC",null,null,null,{"$f":"IF(E38=\"\",\"\",E38-D38)","v":""},"",{"$f":"IF(ISERROR(G38*62.4),\"\",(G38*62.4))","v":""},null,null,null,null,null,null,null,{"$f":"IF(R38=\"\",\"\",((C38/F38)*(T38/R38))*100/I40)","v":""}]
[6,null,null,null,null,{"$f":"IF(E39=\"\",\"\",E39-D39)","v":""},"",{"$f":"IF(ISERROR(G39*62.4),\"\",(G39*62.4))","v":""},null,null,null,null,null,null,null,{"$f":"IF(R39=\"\",\"\",((C39/F39)*(T39/R39))*100/I40)","v":""}]
["Average",null,null," ",null,null,{"$f":"IF(G38=\"\",\"\",AVERAGE(G38:G39))","v":""},{"$f":"IF(H38=\"\",\"\",AVERAGE(H38:H39))","v":""},{"$f":"IF(B40=\"\",\"\",100/((B40/1.03)+((100-B40)/$O$24)))","v":""},{"$f":"IF(I40=\"\",\"\",((I40-G40)/I40)*100)","v":""},{"$f":"IF(B40=\"\",\"\",($O$24-$O$23)/($O$24*$O$23)*$O$25*(100-B40))","v":""},{"$f":"IF(B40=\"\",\"\",(B40-K40))","v":""},{"$f":"IF(B40=\"\",\"\",100-(G40*(100-B40)/$O$23))","v":""},{"$f":"IF(M40=\"\",\"\",(100*(M40-J40)/M40))","v":""},{"$f":"IF(L40=\"\",\"\",(10*((L40/100)/($H$98*(1-L40/100))/0.00003937)+0.5)/10)","v":""},{"$f":"IF(P38=\"\",\"\",AVERAGE(P38:P39))","v":""},{"$f":"IF($L$40=\"\",\"\",($T$28/L40))","v":""}]
[7,"% AC",null,null,null,{"$f":"IF(E41=\"\",\"\",E41-D41)","v":""},"",{"$f":"IF(ISERROR(G41*62.4),\"\",(G41*62.4))","v":""},null,null,null,null,null,null,null,{"$f":"IF(R41=\"\",\"\",((C41/F41)*(T41/R41))*100/I43)","v":""}]
[8,null,null,null,null,{"$f":"IF(E42=\"\",\"\",E42-D42)","v":""},"",{"$f":"IF(ISERROR(G42*62.4),\"\",(G42*62.4))","v":""},null,null,null,null,null,null,null,{"$f":"IF(R42=\"\",\"\",((C42/F42)*(T42/R42))*100/I43)","v":""}]
["Average",null,null,null,null,null,{"$f":"IF(G41=\"\",\"\",AVERAGE(G41:G42))","v":""},{"$f":"IF(H41=\"\",\"\",AVERAGE(H41:H42))","v":""},{"$f":"IF(B43=\"\",\"\",100/((B43/1.03)+((100-B43)/$O$24)))","v":""},{"$f":"IF(I43=\"\",\"\",((I43-G43)/I43)*100)","v":""},{"$f":"IF(B43=\"\",\"\",($O$24-$O$23)/($O$24*$O$23)*$O$25*(100-B43))","v":""},{"$f":"IF(B43=\"\",\"\",(B43-K43))","v":""},{"$f":"IF(B43=\"\",\"\",100-(G43*(100-B43)/$O$23))","v":""},{"$f":"IF(M43=\"\",\"\",(100*(M43-J43)/M43))","v":""},{"$f":"IF(L43=\"\",\"\",(10*((L43/100)/($H$98*(1-L43/100))/0.00003937)+0.5)/10)","v":""},{"$f":"IF(P41=\"\",\"\",AVERAGE(P41:P42))","v":""},{"$f":"IF($L$43=\"\",\"\",($T$28/L43))","v":""}]
["Specimens at optimum AC:"]
["Sample #","% AC",null,"Weight (g)",null,"Bulk Vol.","BSG","Unit Wt. @","Max Spec","% Voids","% Abs. AC","% Eff. AC","% VMA","% VFA","Film Th.","%Gmm","D/A","Height","Height","Height","%Gmm"]
[null,"(Mix)","(Air)","(Water)","(SSD)","(g)","@ Ndes","Ndes (pcf)","Gravity","@ Ndes","(Mix)",null,"@ Ndes","@ Ndes","(µm)","@ Nini","Ratio","@ Nini (mm)","@ Ndes (mm)","@ Nmax(mm)","@ Nmax"]
["A","% AC",null,null,null,{"$f":"IF(E47=\"\",\"\",E47-D47)","v":""},{"$f":"IF(ISERROR(C47/F47),\"\",((C47/F47)*(T47/S47)))","v":""},{"$f":"IF(ISERROR(G47*62.4),\"\",(G47*62.4))","v":""},null,null,null,null,null,null,null,{"$f":"IF(T47=\"\",\"\",((C47/F47)*(T47/R47))*100/I49)","v":""},null,null,null,null,{"$f":"IF(T47=\"\",\"\",((C47/F47)*(T47/T47))*100/I49)","v":""},null,{"$f":"(C47+C48)/2","v":0},{"$f":"IF(W47=0,\"\",(115/W48))","v":""}]
["B",null,null,null,null,{"$f":"IF(E48=\"\",\"\",E48-D48)","v":""},{"$f":"IF(ISERROR(C48/F48),\"\",((C48/F48)*(T48/S48)))","v":""},{"$f":"IF(ISERROR(G48*62.4),\"\",(G48*62.4))","v":""},null,null,null,null,null,null,null,{"$f":"IF(T48=\"\",\"\",((C48/F48)*(T48/R48))*100/I49)","v":""},null,null,null,null,{"$f":"IF(T48=\"\",\"\",((C48/F48)*(T48/T48))*100/I49)","v":""},null,{"$f":"(S47+S48)/2","v":0},{"$f":"IF(W47=0,\"\",+X47*W47)","v":""}]
["Average",null,null,null,null,null,{"$f":"IF(G47=\"\",\"\",AVERAGE(G47:G48))","v":""},{"$f":"IF(H47=\"\",\"\",AVERAGE(H47:H48))","v":""},{"$f":"IF(B49=\"\",\"\",100/((B49/1.03)+((100-B49)/$O$24)))","v":""},{"$f":"IF(I49=\"\",\"\",((I49-G49)/I49)*100)","v":""},{"$f":"IF(B49=\"\",\"\",($O$24-$O$23)/($O$24*$O$23)*$O$25*(100-B49))","v":""},{"$f":"IF(B49=\"\",\"\",(B49-K49))","v":""},{"$f":"IF(B49=\"\",\"\",100-(G49*(100-B49)/$O$23))","v":""},{"$f":"IF(M49=\"\",\"\",(100*(M49-J49)/M49))","v":""},{"$f":"IF(L49=\"\",\"\",(10*((L49/100)/($H$98*(1-L49/100))/0.00003937)+0.5)/10)","v":""},{"$f":"IF(P47=\"\",\"\",AVERAGE(P47:P48))","v":""},{"$f":"IF($L$49=\"\",\"\",($T$28/L49))","v":""},null,null,null,{"$f":"IF(U47=\"\",\"\",AVERAGE(U47:U48))","v":""}]
[]
["RANDOM NUMBER GENERATOR",null,null,null,null,null,null,null,null,null,null,"Design Property",null,null,"Design Value","Criteria",null,null,"Reference Information"]
["PLEASE NOTE:  Random numbers can only be generated one time.  Make",null,null,null,null,null,null,null,null,null,null,"Coarse Aggregate Angularity (%)",null,null,null,{"$f":"IF(ISTEXT(H20),\"\",IF(K20=\"\",\"ENTER\",IF(OR(H20<>\"\",K20<>\"\"),IF(H20<=3,'Chart Data'!BO9,'Chart Data'!BP9),\"\")))","v":""},null,null,"County:",{"$f":"IF($N$80=\"\",\"\",\"N/A\")","v":""},""]
["sure the correct tonnage appears below.  If so, press GENERATE.",null,null,null,null,null,null,null,null,null,null,"Fine Aggregate Angularity (%)",null,null,null,{"$f":"IF(ISTEXT(H20),\"\",IF(K20=\"\",\"DEPTH\",IF(OR(H20<>\"\",K20<>\"\"),'Chart Data'!BP17)))","v":""},null,null,"Mix ID #:","",""]
[null,null,null,{"$f":"IF('Chart Data'!K48=\"M\",\"Metric Tons =\",\"English Tons =\")","v":"English Tons ="},null,null,null,null,null,null,null,"Flat & Elongated Particles (%)",null,null,null,{"$f":"IF('Chart Data'!J48=\"NO. 4\",\"N/A\",IF(ISTEXT(H20),\"\",IF(K20=\"\",\"FROM\",\"10 (maximum)\")))","v":""},null,null,"Binder:","",""]
["Sublot","Rand. #","Sublot","Rand. #","Sublot","Rand. #","Sublot","Rand. #","Sublot","Rand. #",null,"Clay Content (SE) (%)",null,null,null,{"$f":"IF(ISTEXT(H20),\"\",IF(K20=\"\",\"SURFACE\",IF(H20=2,\"40 (minimum)\",IF(H20=3,\"45 (minimum)\",\"50 (minimum)\"))))","v":""},null,null,"Date Released:",null,{"$f":"IF($N$80=\"\",\"\",\"N/A\")","v":""}]
[null,null,null,null,null,null,null,null,null,null,null,"% VFA",null,null,{"$f":"IF(AND(Graphs!K77=\"\",N34=\"\"),\"\",IF(AND(Graphs!K77=\"\",N34<>0),N34,Graphs!K77))","v":""},{"$f":"IF(AND(H20=2,'Chart Data'!J48=\"NO. 4\"),\"67 - 77\",IF(AND(H20>2,'Chart Data'!J48=\"NO. 4\"),\"66 - 77\",IF(H20=\"N/A\",\"\",IF(AND(H20=1,'Chart Data'!J48=1.5),\"64 - 80\",IF(AND(H20=2,'Chart Data'!J48=1.5),\"64 - 78\",IF(AND(H20=3,'Chart Data'!J48=1.5),\"64 - 75\",IF(AND(H20=4,'Chart Data'!J48=1.5),\"64 - 75\",V56)))))))","v":""},null,null,"Design AC %:",null,{"$f":"IF($N$80=\"\",\"\",\"N/A\")","v":""},{"$f":"IF(AND(H20=1,'Chart Data'!J48=1),\"67 - 80\",IF(H20=1,\"70 - 80\",IF(H20=2,\"65 - 78\",IF(AND(H20=3,'Chart Data'!J48=0.38),\"73 - 76\",IF(H20=3,\"65 - 75\",IF('Chart Data'!J48=0.38,\"73 - 76\",IF(AND('Chart Data'!J48>0.38,'Chart Data'!J48<=1.5),\"65 - 75\",\"\")))))))","v":""}]
[null,null,null,null,null,null,null,null,null,null,null,"% VMA",null,null,{"$f":"IF(AND(Graphs!K26=\"\",M34=\"\"),\"\",IF(AND(Graphs!K26=\"\",M34<>0),M34,Graphs!K26))","v":""},{"$f":"IF(ISTEXT(H20),\"\",IF('Chart Data'!W14=\"Bid Item Not In Drop-Down List\",CONCATENATE('Chart Data'!X17 & \" (minimum)\"),IF('Chart Data'!BS9=\"\",\"\",CONCATENATE('Chart Data'!BS9 & \".0 (minimum)\"))))","v":""},null,null,"Job Complete?",null,{"$f":"IF($N$80=\"\",\"\",\"N/A\")","v":""}]
[null,null,null,null,null,null,null,null,null,null,null,"D/A Ratio",null,null,{"$f":"IF(AND(Graphs!K140=\"\",Q34=\"\"),\"\",IF(AND(Graphs!K140=\"\",Q34<>0),Q34,Graphs!K140))","v":""},{"$f":"IF('Chart Data'!BP13=\"\",\"\",IF('Chart Data'!BP13=\"NO. 4\", \"1.0 - 2.0\",IF(OR('Chart Data'!BP13=0.38,'Chart Data'!BP13=0.5),\"0.6 - 1.4\",\"0.6 - 1.6\")))","v":""},null,null,{"$f":"IF($N$80=\"\",\"\",\"(Other information)\")","v":""},{"$f":"IF($N$80=\"\",\"\",\"(Other information)\")","v":""},{"$f":"IF($N$80=\"\",\"\",\"(Other information)\")","v":""}]
[null,null,null,null,null,null,null,null,null,null,null,"% Gmm @ Ninitial",null,null,{"$f":"IF(AND(Graphs!K20=\"\",P34=\"\"),\"\",IF(AND(Graphs!K20=\"\",P34<>0),P34,Graphs!K20))","v":""},{"$f":"IF(ISTEXT(H20),\"\",IF(K20=\"\",\"\",IF(H20=1,\"91.5 (maximum)\",IF(H20=2,\"90.5 (maximum)\",\"89.0 (maximum)\"))))","v":""}]
[null,null,null,null,null,null,null,null,null,null,null,"% Gmm @ Nmax",null,null,{"$f":"U49","v":""},{"$f":"IF(ISTEXT(H20),\"\",IF(K20=\"\",\"\",\"98.5 (maximum)\"))","v":""},null,null,"Sieve","JMF","Revised"]
[null,null,null,null,null,null,null,null,null,null,null,"% Air Voids",null,null,{"$f":"IF(AND(Graphs!K23=\"\",J34=\"\"),\"\",IF(AND(Graphs!K23=\"\",J34<>0),J34,Graphs!K23))","v":""},{"$f":"IF(ISNUMBER(H20),3.5,\"\")","v":""},null,null,{"$f":"S15","v":"2 \""},{"$f":"IF(T15=\"\",\"\",T15)","v":100},100]
[null,null,null,null,null,null,null,null,null,null,null,"Unit Weight (lb/ft3)",null,null,{"$f":"IF(AND(Graphs!K80=\"\",H34=\"\"),\"\",IF(AND(Graphs!K80=\"\",H34<>0),H34,Graphs!K80))","v":""},null,null,null,"1 1/2 \"",""]
[null,null,null,null,null,null,null,null,null,null,null,"% AC",null,null,{"$f":"IF(AND(Graphs!K17=\"\",B34=\"\"),\"\",IF(AND(Graphs!K17=\"\",B34<>0),B34,Graphs!K17))","v":""},{"$f":"IF(AND(ISNUMBER(H20),'Chart Data'!J48=0.5,O63<5.3,'Chart Data'!H48<>20550),\"AC% OUT OF SPEC.\",IF(AND(ISNUMBER(H20),'Chart Data'!J48=0.38,O63<5.6),\"AC% OUT OF SPEC.\",\"\"))","v":""},null,null,"1 \"",""]
[null,null,null,null,null,null,null,null,null,null,null,"% Effective AC",null,null,{"$f":"Graphs!K134","v":""},{"$f":"IF('Chart Data'!BK9=\"NO\",\"See Recycle Data Tab\",\"\")","v":""},null,null,"3/4 \"",""]
[null,null,null,null,null,null,null,null,null,null,null,"Maximum Specific Gravity",null,null,{"$f":"IF(AND(Graphs!K83=\"\",I34=\"\"),\"\",IF(AND(Graphs!K83=\"\",I34<>0),I34,Graphs!K83))","v":""},null,null,null,"1/2 \"",""]
[null,null,null,null,null,null,null,null,null,null,null,"% Absorbed AC (Mix)",null,null,{"$f":"IF(AND(K49=\"\",K34=\"\"),\"\",IF(K49=\"\",K34,K49))","v":""},null,null,null,"3/8 \"",""]
[null,null,null,null,null,null,null,null,null,null,null,"Gsb",null,null,{"$f":"O23","v":""},null,null,null,"1/4 \"","N / A",{"$f":"T67","v":"N / A"}]
[null,null,null,null,null,null,null,null,null,null,null,"Gse",null,null,{"$f":"O24","v":""},null,null,null,"#4",""]
[null,null,null,null,null,null,null,null,null,null,null,"Film Thickness (µm)",null,null,{"$f":"IF(AND(Graphs!K137=\"\",O34=\"\"),\"\",IF(AND(Graphs!K137=\"\",O34<>0),O34,Graphs!K137))","v":""},null,null,null,"#8",""]
[null,null,null,null,null,null,null,null,null,null,null,"Specimen Weight (g)",null,null,{"$f":"IF(X48=\"\",\"\",X48)","v":""},null,null,null,"#16",""]
[null,null,null,null,null,null,null,null,null,null,null,"TSR Weight (g)",null,null,null,null,null,null,"#30",""]
[null,null,null,null,null,null,null,null,null,null,null,"% TSR without additive",null,null,{"$f":"TSR!G57","v":""},{"$f":"IF(ISNUMBER(H20),\"80 (minimum)\",\"\")","v":""},null,null,"#50",""]
[null,null,null,null,null,null,null,null,null,null,null,"% TSR with additive",null,null,{"$f":"TSR!N57","v":""},{"$f":"IF(ISNUMBER(H20),\"80 (minimum)\",\"\")","v":""},null,null,"#100",""]
[null,null,null,null,null,null,null,null,null,null,null,"% Additive",null,null,{"$f":"IF(TSR!G18=\"\",\"\",IF(TSR!H18=\"\",\"N/A\",TSR!H18))","v":""},null,null,null,"#200",""]
[null,null,null,null,null,null,null,null,null,null,null,"Type of Additive",null,null,{"$f":"IF(TSR!G18=\"\",\"\",IF(TSR!G20=\"\",\"None Required\",TSR!G20))","v":""}]
[null,null,null,null,null,null,null,null,null,null,null,"NOTES:",null,null,null,null,null,null,{"$f":"IF(I29=\"\",\"\",\"Recycle Information\")","v":""}]
[null,null,null,null,null,null,null,null,null,null,null,null,null,null,null,null,null,null,{"$f":"IF(I29=\"\",\"\",\"%AC in Recycle:\")","v":""},null,{"$f":"IF(I29=\"\",\"\",'Chart Data'!Q115)","v":""}]
[null,null,null,null,null,null,null,null,null,null,null,{"$f":"IF(Q80=\"\",\"\",\"(Enter Reference Info. Above)\")","v":""},null,null,null,null,null,null,{"$f":"IF(I29=\"\",\"\",\"%Virgin AC in mix:\")","v":""},null,{"$f":"IF(I29=\"\",\"\",'Chart Data'!Q116)","v":""}]
[null,null,null,null,null,null,null,null,null,null,null,{"$f":"IF(OR(H20=1,H20=2),\"\",\"Complete SGC Des.\")","v":"Complete SGC Des."},null,null,{"$f":"IF(OR(H20=1,H20=2),\"\",\"1-Pt. SGC Des.\")","v":"1-Pt. SGC Des."},null,null,null,{"$f":"IF(I29=\"\",\"\",\"%Recycle AC in mix:\")","v":""},null,{"$f":"IF(I29=\"\",\"\",'Chart Data'!Q117)","v":""}]
[null,null,null,null,null,null,null,null,null,null,null,"App.-New Design",null,null,"App.-Ref. Mix",null,null,null,{"$f":"IF(I29=\"\",\"\",\"Total %AC in mix:\")","v":""},null,{"$f":"IF(I29=\"\",\"\",'Chart Data'!Q118)","v":""}]
[null,null,null,null,null,null,null,null,null,null,null,"MCL Design",null,null,"Contr. Design",null,null,null,"APPROVED BY:"]
[null,null,null,null,null,null,null,null,null,null,null,"Revised Asphalt Content (+ or - 0.3 %):"]
[]
[null,null,"GRAPH DATA"]
["AC","Gmmini","AC","AV","AC","VMA",null,"MCL Mix Date"]
[{"$f":"IF($B$34=\"\",\"\",$B$34)","v":""},{"$f":"P34","v":""},{"$f":"IF($B$34=\"\",\"\",$B$34)","v":""},{"$f":"J34","v":""},{"$f":"IF($B$34=\"\",\"\",$B$34)","v":""},{"$f":"M34","v":""},null,null,null,null,null,null,null,null,null,"Gyration Data"]
[{"$f":"IF($B$37=\"\",\"\",$B$37)","v":""},{"$f":"P37","v":""},{"$f":"IF($B$37=\"\",\"\",$B$37)","v":""},{"$f":"J37","v":""},{"$f":"IF($B$37=\"\",\"\",$B$37)","v":""},{"$f":"M37","v":""},null,null,null,null,null,null,null,null,null,"Nini",{"$f":"IF(H20=2,7,IF(H20=3,7,IF(H20=4,7,\"\")))","v":""}]
[{"$f":"IF($B$40=\"\",\"\",$B$40)","v":""},{"$f":"P40","v":""},{"$f":"IF($B$40=\"\",\"\",$B$40)","v":""},{"$f":"J40","v":""},{"$f":"IF($B$40=\"\",\"\",$B$40)","v":""},{"$f":"M40","v":""},"AGGREGATE",null,null,null,null,null,null,null,null,"Ndes",{"$f":"IF(H20=2,65,IF(H20=3,65,IF(H20=4,65,\"\")))","v":""}]
[{"$f":"IF($B$43=\"\",\"\",$B$43)","v":""},{"$f":"P43","v":""},{"$f":"IF($B$43=\"\",\"\",$B$43)","v":""},{"$f":"J43","v":""},{"$f":"IF($B$43=\"\",\"\",$B$43)","v":""},{"$f":"M43","v":""},{"$f":"IF(L23=\"\",\"\",L23)","v":""},{"$f":"IF(M23=\"\",\"\",M23)","v":""},{"$f":"IF(ISERROR(H89/G89),\"\",H89/G89)","v":""},null,null,null,null,null,null,"Nmax",{"$f":"IF(H20=2,105,IF(H20=3,105,IF(H20=4,105,\"\")))","v":""}]
["AC","VFA","AC","UW","AC","MSG",{"$f":"IF(L24=\"\",\"\",L24)","v":""},{"$f":"IF(M24=\"\",\"\",M24)","v":""},""]
[{"$f":"IF($B$34=\"\",\"\",$B$34)","v":""},{"$f":"N34","v":""},{"$f":"IF($B$34=\"\",\"\",$B$34)","v":""},{"$f":"H34","v":""},{"$f":"IF($B$34=\"\",\"\",$B$34)","v":""},{"$f":"I34","v":""},{"$f":"IF(L25=\"\",\"\",L25)","v":""},"",""]
[{"$f":"IF($B$37=\"\",\"\",$B$37)","v":""},{"$f":"N37","v":""},{"$f":"IF($B$37=\"\",\"\",$B$37)","v":""},{"$f":"H37","v":""},{"$f":"IF($B$37=\"\",\"\",$B$37)","v":""},{"$f":"I37","v":""},"","",""]
[{"$f":"IF($B$40=\"\",\"\",$B$40)","v":""},{"$f":"N40","v":""},{"$f":"IF($B$40=\"\",\"\",$B$40)","v":""},{"$f":"H40","v":""},{"$f":"IF($B$40=\"\",\"\",$B$40)","v":""},{"$f":"I40","v":""},"","","",null,null,"Warm Mix Asphalt Data"]
[{"$f":"IF($B$43=\"\",\"\",$B$43)","v":""},{"$f":"N43","v":""},{"$f":"IF($B$43=\"\",\"\",$B$43)","v":""},{"$f":"H43","v":""},{"$f":"IF($B$43=\"\",\"\",$B$43)","v":""},{"$f":"I43","v":""},"","","",null,null,"Planned Production Temp (oF)"]
["AC","Eff. AC","AC","Film Th","AC","D/A",null,"SUM=",{"$f":"IF(I89=\"\",\"\",SUM(I89:I94))","v":""},null,null,"WMA Process/Product"]
[{"$f":"IF($B$34=\"\",\"\",$B$34)","v":""},{"$f":"IF(L34=\"\",\"\",L34)","v":""},{"$f":"IF($B$34=\"\",\"\",$B$34)","v":""},{"$f":"IF(O34=\"\",\"\",O34)","v":""},{"$f":"IF($B$34=\"\",\"\",$B$34)","v":""},{"$f":"IF(Q34=\"\",\"\",Q34)","v":""},null,null,null,null,null,"Additive (% of Total Binder)"]
[{"$f":"IF($B$37=\"\",\"\",$B$37)","v":""},{"$f":"IF(L37=\"\",\"\",L37)","v":""},{"$f":"IF($B$37=\"\",\"\",$B$37)","v":""},{"$f":"IF(O37=\"\",\"\",O37)","v":""},{"$f":"IF($B$37=\"\",\"\",$B$37)","v":""},{"$f":"IF(Q37=\"\",\"\",Q37)","v":""},"SA = ",{"$f":"IF(T74=\"\",\"\",(2+(2*T68+4*T69+8*T70+14*T71+30*T72+60*I98+160*T74)/100)*O23/2.65)","v":""},null,{"$f":"IF(T74=\"\",\"\",(2+(2*T68+4*T69+8*T70+14*T71+30*(T72+1)+60*(I98+1)+160*(T74+1.5))/100)*O23/2.65)","v":""}]
[{"$f":"IF($B$40=\"\",\"\",$B$40)","v":""},{"$f":"IF(L40=\"\",\"\",L40)","v":""},{"$f":"IF($B$40=\"\",\"\",$B$40)","v":""},{"$f":"IF(O40=\"\",\"\",O40)","v":""},{"$f":"IF($B$40=\"\",\"\",$B$40)","v":""},{"$f":"IF(Q40=\"\",\"\",Q40)","v":""},"ALPHA =",{"$f":"IF(H97=\"\",\"\",(1.96*O25*O23*H97))","v":""},{"$f":"IF($T$74=\"\",\"\",($T$72-((0.3-0.15)/(0.3-0.075))*($T$72-$T$74)))","v":""},{"$f":"IF(J97=\"\",\"\",(1.96*O25*O23*J97))","v":""},null,"Hot Mix Asphalt with Additive Data"]
[{"$f":"IF($B$43=\"\",\"\",$B$43)","v":""},{"$f":"IF(L43=\"\",\"\",L43)","v":""},{"$f":"IF($B$43=\"\",\"\",$B$43)","v":""},{"$f":"IF(O43=\"\",\"\",O43)","v":""},{"$f":"IF($B$43=\"\",\"\",$B$43)","v":""},{"$f":"IF(Q43=\"\",\"\",Q43)","v":""}," "," ",null,null,null,"Planned Production Temp (oF)"]
[null,null,null,null,null,null,null,null,null,null,null,"Product"]
[null,null," Graph Limits",null,null,null,null,null,null,null,null,"Additive (% of Total Binder)"]
["Gmmini Limits",null,"AV Limits",null,"VMA Limits"]
[{"$f":"A86","v":""},{"$f":"IF(A103=\"\",\"\",IF(H20=1,91.5,IF(H20=2,90.5,89)))","v":""},{"$f":"C86","v":""},{"$f":"IF(C103=\"\",\"\",3.5)","v":""},{"$f":"E86","v":""},{"$f":"IF(E103=\"\",\"\",IF(ISNUMBER(H20),'Chart Data'!BS9,\"\"))","v":""}]
[{"$f":"A89","v":""},{"$f":"IF(A104=\"\",\"\",IF(H20=1,91.5,IF(H20=2,90.5,89)))","v":""},{"$f":"C89","v":""},{"$f":"IF(C104=\"\",\"\",3.5)","v":""},{"$f":"E89","v":""},{"$f":"IF(E104=\"\",\"\",IF(ISNUMBER(H20),'Chart Data'!BS9,\"\"))","v":""}]
["VFA Limits",null,"D/A Limits"]
[{"$f":"A91","v":""},{"$f":"IF(P56=\"\",\"\",VALUE(LEFT(P56,2)))","v":""},{"$f":"E96","v":""},{"$f":"IF(C106=\"\",\"\",0.6)","v":""}]
[{"$f":"A94","v":""},{"$f":"B106","v":""},{"$f":"E99","v":""},{"$f":"IF(C107=\"\",\"\",0.6)","v":""}]
[{"$f":"A91","v":""},{"$f":"IF(P56=\"\",\"\",VALUE(RIGHT(P56,2)))","v":""},{"$f":"E96","v":""},{"$f":"IF(P58=\"\",\"\",VALUE(RIGHT(P58,3)))","v":""}]
[{"$f":"A94","v":""},{"$f":"B108","v":""},{"$f":"E99","v":""},{"$f":"IF(P58=\"\",\"\",VALUE(RIGHT(P58,3)))","v":""}]
[]
["MCL Aggregate Verification Information"]
["AGG. PROD. NO.",null,"PRODUCER NAME",null,null,null,null,"MAT. CODE ",null,"AGG. TYPE",null,"Con. Gsb","S/C","SiteManager Agg. ID #"]
[{"$f":"IF(A23=\"\",\"\",A23)","v":""},null,{"$f":"IF(C23=\"\",\"\",C23)","v":""},null,null,null,null,{"$f":"IF(H23=\"\",\"\",H23)","v":""},null,{"$f":"IF(J23=\"\",\"\",J23)","v":""},null,{"$f":"IF(L23=\"\",\"\",L23)","v":""}]
["",null,"",null,null,null,null,"",null,"",null,""]
["",null,"",null,null,null,null,"",null,"",null,""]
["",null,"",null,null,null,null,"",null,"",null,""]
["",null,"",null,null,null,null,"",null,"",null,""]
["",null,"",null,null,null,null,"",null,"",null,""]
[]
["NOTES:",null,null,null,null,null,null,null,null,"MCL Concensus (& additional) Verification Information"]
[null,null,null,null,null,null,null,null,null,"TEST TYPE",null,null,"S/C","SiteManager ID #"]
[]
[]
[]
[]
[]
[null,null,null,null,null,null,null,null,null,null,null,null,null,null,null,null,"<=======","Binder"]

{"sheet":"Rand. #'s (cont.)","index":1,"n_rows":127,"n_cols":31,"rows_kept":127,"cut":false,"hidden":true,"merged":[[2,16,2,20],[1,11,1,20],[3,13,3,20],[4,13,4,15],[4,18,4,20],[4,16,4,17]]}
[]
["RANDOM NUMBER GENERATOR (CONTINUED)",null,null,null,null,null,null,null,null,null,null,"PROJECT INFORMATION"]
["PLEASE NOTE:  Random numbers can only be generated one time.  Make",null,null,null,null,null,null,null,null,null,null,"Mix ID #:",null,{"$f":"IF('Design Data'!H10=\"\",\"\",'Design Data'!H10)","v":""},null,"County:",{"$f":"IF('Design Data'!K10=\"\",\"\",'Design Data'!K10)","v":""}]
["sure the correct tonnage appears below.",null,null,null,null,null,null,null,null,null,null,"Mix Type:",null,{"$f":"IF(N5=\"\",\"\",'Chart Data'!W14)","v":""}]
[null,null,null,"TONNAGE =",null,null,null,null,null,null,null,"Contract ID:",null,{"$f":"IF('Design Data'!C8=\"\",\"\",'Design Data'!C8)","v":""},null,null,"Binder Type:",null,{"$f":"IF(N5=\"\",\"\",'Design Data'!C18)","v":""}]
["Sublot","Rand. #","Sublot","Rand. #","Sublot","Rand. #","Sublot","Rand. #","Sublot","Rand. #",null,"Project #:",null,"Enter Project(s) & Line Item(s) On 'Project Items' Tab."]
[null,null,null,null,null,null,null,null,null,null,null,null,null,null,null,null,null,null,null,null,null,null,null,null,null,null,"Coarse Aggregate Angularity Criteria",null,"Fine Aggregate Angularity Criteria",null," "]
[null,null,null,null,null,null,null,null,null,null,null,null,null,null,null,null,null,null,null,null,null,null,null,null,null,null,"<=100mm",">100 mm","<=100mm",">100 mm"]
[null,null,null,null,null,null,null,null,null,null,null,null,null,null,null,null,null,null,null,null,null,null,null,null,null,null,"75/- (minimum)","75/-","- ","- "]
[null,null,null,null,null,null,null,null,null,null,null,null,null,null,null,null,null,null,null,null,null,null,null,null,null,null,"75/- (minimum)","75/- (minimum)","40 (minimum)","40 (minimum)"]
[null,null,null,null,null,null,null,null,null,null,null,null,null,null,null,null,null,null,null,null,null,null,null,null,null,null,"95/90 (minimum)","80/75 (minimum)","45 (minimum)","40 (minimum)"]
[null,null,null,null,null,null,null,null,null,null,null,null,null,null,null,null,null,null,null,null,null,null,null,null,null,null,"100/100 (minimum)","100/100 (minimum)","45 (minimum)","45 (minimum)"]
[]
[]
[]
[]
[]
[]
[]
[]
[]
[]
[]
[]
[]
[]
[]
[]
[]
[]
[]
[]
[]
[]
[]
[]
["RANDOM NUMBER GENERATOR (CONTINUED)",null,null,null,null,null,null,null,null,null,null,"RANDOM NUMBER GENERATOR (CONTINUED)"]
["PLEASE NOTE:  Random numbers can only be generated one time.  Make",null,null,null,null,null,null,null,null,null,null,"PLEASE NOTE:  Random numbers can only be generated one time.  Make"]
["sure the correct tonnage appears below.",null,null,null,null,null,null,null,null,null,null,"sure the correct tonnage appears below."]
[null,null,null,"TONNAGE =",null,null,null,null,null,null,null,null,null,null,"TONNAGE ="]
["Sublot","Rand. #","Sublot","Rand. #","Sublot","Rand. #","Sublot","Rand. #","Sublot","Rand. #",null,"Sublot","Rand. #","Sublot","Rand. #","Sublot","Rand. #","Sublot","Rand. #","Sublot","Rand. #"]
[]
[]
[]
[]
[]
[]
[]
[]
[]
[]
[]
[]
[]
[]
[]
[]
[]
[]
[]
[]
[]
[]
[]
[]
[]
[]
[]
[null,null,null,null,null,null,null,null,null,null,null,"",null,null,null,""]
[]
[]
["RANDOM NUMBER GENERATOR (CONTINUED)",null,null,null,null,null,null,null,null,null,null,"RANDOM NUMBER GENERATOR (CONTINUED)"]
["PLEASE NOTE:  Random numbers can only be generated one time.  Make",null,null,null,null,null,null,null,null,null,null,"PLEASE NOTE:  Random numbers can only be generated one time.  Make"]
["sure the correct tonnage appears below.",null,null,null,null,null,null,null,null,null,null,"sure the correct tonnage appears below."]
[null,null,null,"TONNAGE =",null,null,null,null,null,null,null,null,null,null,"TONNAGE ="]
["Sublot","Rand. #","Sublot","Rand. #","Sublot","Rand. #","Sublot","Rand. #","Sublot","Rand. #",null,"Sublot","Rand. #","Sublot","Rand. #","Sublot","Rand. #","Sublot","Rand. #","Sublot","Rand. #"]
[]
[]
[]
[]
[]
[]
[]
[]
[]
[]
[]
[]
[]
[]
[]
[]
[]
[]
[]
[]
[]
[]
[]
[]
[]
[]
[]
[null,null,null,null,null,null,null,null,null,null,null,""]
[]
[]
[]
[]
[]
[]
[]
[]
[]
[]
[]
[]
[]
[]
[]
[]
[]
[]
[]
[]
[""]
[]
["muley"]

{"sheet":"Polish-Resistant Data","index":2,"n_rows":45,"n_cols":7,"rows_kept":45,"cut":false,"hidden":true,"merged":[[6,5,7,6],[41,4,41,5],[42,4,42,5],[44,4,44,5],[11,0,11,6]]}
[null,null,null,null,null,null,{"$f":"'Design Data'!U2","v":"October 2022"}]
["Kentucky Transportation Cabinet, Department of Highways, Division of Materials"]
["Asphalt Mixtures Testing Section"]
["1227 Wilkinson Boulevard, Frankfort, KY  40601-1226"]
[]
[]
["Mix ID #:",{"$f":"IF('Design Data'!$H$10=\"\",\"\",'Design Data'!H10)","v":""},"County:",{"$f":"IF('Design Data'!$K$10=\"\",\"\",'Design Data'!$K$10)","v":""},"Type of Mix:",{"$f":"IF('Chart Data'!$W$14=\"\",\"\",'Chart Data'!$W$14)","v":""}]
["Project Number:",{"$f":"'Design Data'!$C$14","v":"Enter Project(s) & Line Item(s)"}]
[null,{"$f":"'Design Data'!$C$15","v":"On 'Project Items' Tab."}]
["Contractor & Loc.:",{"$f":"'Design Data'!$I$15","v":""},null,null,"Type of Mixture to be Placed:"]
[]
["Polish Resistant Aggregate Calculator"]
[]
["Component",{"$f":"IF('Design Data'!J23=\"\",\"\",'Design Data'!J23)","v":""},{"$f":"IF('Design Data'!J24=\"\",\"\",'Design Data'!J24)","v":""},{"$f":"IF('Design Data'!J25=\"\",\"\",'Design Data'!J25)","v":""},{"$f":"IF('Design Data'!J26=\"\",\"\",'Design Data'!J26)","v":""},{"$f":"IF('Design Data'!J27=\"\",\"\",'Design Data'!J27)","v":""},{"$f":"IF('Design Data'!J28=\"\",\"\",'Design Data'!J28)","v":""}]
["Producer #",{"$f":"IF('Design Data'!A23=\"\",\"\",'Design Data'!A23)","v":""},{"$f":"IF('Design Data'!A24=\"\",\"\",'Design Data'!A24)","v":""},{"$f":"IF('Design Data'!A25=\"\",\"\",'Design Data'!A25)","v":""},{"$f":"IF('Design Data'!A26=\"\",\"\",'Design Data'!A26)","v":""},{"$f":"IF('Design Data'!A27=\"\",\"\",'Design Data'!A27)","v":""},{"$f":"IF('Design Data'!A28=\"\",\"\",'Design Data'!A28)","v":""}]
["Cold Feed %",{"$f":"IF('Design Data'!M23=\"\",\"\",'Design Data'!M23)","v":""},{"$f":"IF('Design Data'!M24=\"\",\"\",'Design Data'!M24)","v":""},{"$f":"IF('Design Data'!M25=\"\",\"\",'Design Data'!M25)","v":""},{"$f":"IF('Design Data'!M26=\"\",\"\",'Design Data'!M26)","v":""},{"$f":"IF('Design Data'!M27=\"\",\"\",'Design Data'!M27)","v":""},{"$f":"IF('Design Data'!M28=\"\",\"\",'Design Data'!M28)","v":""}]
["Polish-Res. (?)"]
["% Polish-Res. Credit in RAP"]
[]
["Sieve","JMF","JMF","JMF","JMF","JMF","JMF"]
["2 \""]
["1 1/2 \""]
["1 \""]
["3/4 \""]
["1/2 \""]
["3/8 \""]
["#4"]
["#8"]
["#16"]
["#30"]
["#50"]
["#100"]
["#200"]
[]
["% Passing #4",{"$f":"IF(B27=\"\",\"\",B27)","v":""},"","","","",""]
[" % Retained #4",{"$f":"IF(B35=\"\",\"\",(100-B35))","v":""},"","","","",""]
["Comp. % Retained #4",{"$f":"IF(B16=\"\",\"\",(B16*B36/100))","v":""},"","","","",""]
[]
["Polish-Res. Agg. %",{"$f":"IF(AND(B17=\"YES\",B18=\"\"),B37,IF(B17=\"YES\",B37*B18/100,\"\"))","v":""},"","","","",""]
["Non-Polish-Res. Agg. %",{"$f":"IF(AND(B17=\"YES\",B18<>\"\"),B37*(100-B18)/100,IF(B17=\"NO\",B37,\"\"))","v":""},"","","","",""]
[]
[null,null,null,"Total +4 Retained Polish Resistant Aggregate %",{"$f":"IF(SUM(B39:G39)=0,\"\",SUM(B39:G39))","v":""}]
[null,null,null,"Total +4 Retained Non-Polish Resistant Aggregate %",{"$f":"IF(AND(SUM(B40:G40)=0,ISNUMBER(E42)),0,IF(SUM(B40:G40)=0,\"\",SUM(B40:G40)))","v":""}]
[]
[null,null,null,{"$f":"IF('Chart Data'!L47=\"A\",\"For the 'A' Mixture Selected the '+4' requirement is\",\"For the 'B' Mixture Selected the Polish Resistant\")","v":"For the 'B' Mixture Selected the Polish Resistant"},{"$f":"IF(E43=\"\",\"\",IF(AND(ROUND(E43,0)<=5,'Chart Data'!L47=\"A\"),\"Within Specification Limits\",IF(AND(ROUND(E43,0)>5,'Chart Data'!L47=\"A\"),\"Out of Specification\",IF(AND(E42>=E43,'Chart Data'!L47=\"B\"),\"Within Specification Limits\",IF(AND(E42<E43,'Chart Data'!L47=\"B\"),\"Out of Specification\",\"\")))))","v":""}]

{"sheet":"Recycle Data","index":3,"n_rows":29,"n_cols":16,"rows_kept":29,"cut":false,"hidden":true,"merged":[[28,2,28,13],[21,6,21,8],[12,0,12,1],[12,2,12,5],[11,8,11,9],[12,6,12,7],[24,6,24,8],[13,6,13,7],[18,6,18,8],[19,6,19,8],[26,2,26,13],[11,0,11,1],[20,6,20,8],[12,8,12,9],[23,6,23,8],[16,6,16,8],[13,8,13,9],[22,6,22,8],[6,0,6,15],[14,0,14,1],[14,2,14,5],[14,6,14,7],[14,8,14,9],[13,0,13,1],[13,2,13,5],[10,6,10,7],[11,2,11,5],[11,6,11,7],[10,8,10,9]]}
[null,null,null,null,null,null,null,null,null,null,null,null,null,null,null,{"$f":"'Design Data'!U2","v":"October 2022"}]
["Kentucky Transportation Cabinet, Department of Highways, Division of Materials"]
["Asphalt Mixtures Testing Section"]
["1227 Wilkinson Boulevard, Frankfort, KY  40601-1226"]
[]
[]
["RECYCLE  Calculator"]
[]
["Fill in Recycle MSG's and AC % on this sheet and use Backcalculated Gsb as Agg. Gravity for Recycle Component on Design Data sheet."]
[]
["RECYCLE PROD. NO.",null,"RECYCLE PRODUCER NAME",null,null,null,"MAT. CODE ",null,"RECYCLE TYPE",null,"%","RAP AC%","MSG #1","MSG #2","AVG MSG","Gsb"]
[null,null,null,null,null,null,24030,null,"Intermediate RAP",null,null,null,null,null,{"$f":"IF(L12=\"\",\"\",IF(OR(M12=\"\",N12=\"\"),\"\",AVERAGE(M12:N12)))","v":""},{"$f":"IF(O12=\"\",\"\",((((100*((100-L12)/((100/(O12)-(L12/1.03))))*1.03)/(0.5*((100-L12)/((100/(O12)-(L12/1.03))))+(100*1.03))))))","v":""}]
[null,null,null,null,null,null,null,null,null,null,null,null,null,null,{"$f":"IF(L13=\"\",\"\",IF(OR(M13=\"\",N13=\"\"),\"\",AVERAGE(M13:N13)))","v":""},{"$f":"IF(O13=\"\",\"\",((((100*((100-L13)/((100/(O13)-(L13/1.03))))*1.03)/(0.5*((100-L13)/((100/(O13)-(L13/1.03))))+(100*1.03))))))","v":""}]
[null,null,null,null,null,null,null,null,null,null,null,null,null,null,{"$f":"IF(L14=\"\",\"\",IF(OR(M14=\"\",N14=\"\"),\"\",AVERAGE(M14:N14)))","v":""},{"$f":"IF(O14=\"\",\"\",((((100*((100-L14)/((100/(O14)-(L14/1.03))))*1.03)/(0.5*((100-L14)/((100/(O14)-(L14/1.03))))+(100*1.03))))))","v":""}]
[null,null,null,null,null,null,null,null,null,null,null,null,null,null,{"$f":"IF(L15=\"\",\"\",IF(OR(M15=\"\",N15=\"\"),\"\",AVERAGE(M15:N15)))","v":""},{"$f":"IF(O15=\"\",\"\",((((100*((100-L15)/((100/(O15)-(L15/1.03))))*1.03)/(0.5*((100-L15)/((100/(O15)-(L15/1.03))))+(100*1.03))))))","v":""}]
[]
[null,null,null,null,null,null,"Target Eff. AC% in Mix"]
[]
[null,null,null,null,null,null,{"$f":"IF(I12=\"\",\"\",I12)","v":"Intermediate RAP"},null,null,{"$f":"IF(L12=\"\",\"\",IF(G19=\"Shingles\",ROUND(0.75*L12*K12/100,1),ROUND(L12*K12/100,1)))","v":""}]
[null,null,null,null,null,null,{"$f":"IF(I13=\"\",\"\",I13)","v":""},null,null,{"$f":"IF(L13=\"\",\"\",IF(G20=\"Shingles\",ROUND(0.75*L13*K13/100,1),ROUND(L13*K13/100,1)))","v":""}]
[null,null,null,null,null,null,{"$f":"IF(I14=\"\",\"\",I14)","v":""},null,null,{"$f":"IF(L14=\"\",\"\",IF(G21=\"Shingles\",ROUND(0.75*L14*K14/100,1),ROUND(L14*K14/100,1)))","v":""}]
[null,null,null,null,null,null,{"$f":"IF(I15=\"\",\"\",I15)","v":""},null,null,{"$f":"IF(L15=\"\",\"\",IF(G22=\"Shingles\",ROUND(0.75*L15*K15/100,1),ROUND(L15*K15/100,1)))","v":""}]
[null,null,null,null,null,null,"TOTAL AC from Recycle",null,null,{"$f":"IF(J19=\"\",\"\",SUM(J19:J22))","v":""}]
[null,null,null,null,null,null,"Virgin Binder in Mix",null,null,{"$f":"IF('Design Data'!O63=\"\",\"\",'Design Data'!O63-(SUM(J19:J22)))","v":""}]
[null,null,null,null,null,null,"% Eff. Replacement",null,null,{"$f":"IF('Chart Data'!BK6=\"\",\"\",'Chart Data'!BK6)","v":""}]
[]
[null,null,{"$f":"IF('Chart Data'!BK9=\"NO\",\"The contribution of Asphalt Binder from the reclaimed materials has exceeded the maximum.\",'Design Data'!A19)","v":"(as specified in Bid Item)"}]
[]
[null,null,{"$f":"IF(AND('Recycle Data'!J17<>Graphs!K134,'Chart Data'!J7=\"New Mix Design\"),\"Target Eff. AC% in Mix does not match Calculated Eff. AC%\",\"\")","v":""}]

{"sheet":"Project Items","index":4,"n_rows":5,"n_cols":7,"rows_kept":5,"cut":false,"hidden":false,"merged":[]}
["t_cont_smpl","t_cont_smpl","t_cont_smpl","N/A"]
["Project","Line Item","Represented","Item"]
[null,"Number","Quantity","Code",null,null,"Contractor Entries"]
[null,null,"(in item code unit)","Unit",null,null,"   (Add as many rows as required)"]
["prj_nbr","ln_itm_nbr","repr_qty","Not Stored on the SM database"]

{"sheet":"1-Pt. Check","index":5,"n_rows":37,"n_cols":16,"rows_kept":37,"cut":false,"hidden":false,"merged":[[9,6,9,7],[6,6,7,7]]}
[null,null,null,null,null,null,null,{"$f":"'Design Data'!U2","v":"October 2022"}]
["Kentucky Transportation Cabinet, Department of Highways, Division of Materials"]
["Asphalt Mixtures Testing Section"]
["1227 Wilkinson Boulevard, Frankfort, KY  40601-1226"]
[]
["One-Point Gyratory Specimen Properties Evaluation"]
["Mix ID # & County:",null,{"$f":"IF('Design Data'!K10=\"\",\"\",(CONCATENATE(\"# \",'Design Data'!H10,\", \",'Design Data'!K10,\" County\")))","v":""},null,null,"Mix Type:",{"$f":"'Chart Data'!W14","v":""}]
["Tested By:"]
["Date Received:",null,null,null,null,"Date Comp.:"]
["Test Methods Used:",null,"AASHTO T166 & T209",null,null,"Lab:"]
["Specimens:"]
["Gyratory Specimen Weights"]
[null,"% AC","Spec. No.","Wt. in Air","Wt. in H20","SSD Wt.","BSG",null,null,"Bulk Vol.","B.S.G.","Unit Wt."]
[null,null,null,"(g)","(g)","(g)",null,null,null,"",""]
[null,null,1,null,null,null,{"$f":"IF(D15=\"\",\"\",(D15/(F15-E15)))","v":""}," "," ",{"$f":"IF(F15=\"\",\"\",(F15-E15))","v":""},{"$f":"IF(D15=\"\",\"\",(D15/J15))","v":""},{"$f":"IF(K15=\"\",\"\",(K15*62.4))","v":""}]
[null,null,2,null,null,null,{"$f":"IF(D16=\"\",\"\",(D16/(F16-E16)))","v":""}," "," ",{"$f":"IF(F16=\"\",\"\",(F16-E16))","v":""},{"$f":"IF(D16=\"\",\"\",(D16/J16))","v":""},{"$f":"IF(K16=\"\",\"\",(K16*62.4))","v":""}]
["Maximum Specific Gravity (Gmm) Determination",null,null,null,null,null,null,null," ",{"$f":"IF(J15=\"\",\"\",(SUM(J15:J16)/2))","v":""},{"$f":"IF(K15=\"\",\"\",AVERAGE(K15:K16))","v":""},{"$f":"IF(L15=\"\",\"\",AVERAGE(L15:L16))","v":""}]
["1.  Wt. of Pycnometer + Mix (g)",null,null,null,null,null,null,null," ","",null,""]
["2.  Wt. of Pycnometer (g)"]
["3.  Wt. of Mix (g) [1-2]",null,null,null,{"$f":"IF(E18=\"\",\"\",E18-E19)","v":""},{"$f":"IF(F18=\"\",\"\",F18-F19)","v":""},{"$f":"IF(G18=\"\",\"\",G18-G19)","v":""},null,null,"",null,""]
["4.  Calibration Wt. (g)",null,null,null,null,null,null,null,null,"B.S.G.A.",{"$f":"IF(C33=\"\",\"\",C33)","v":""}]
["5.  Calibration Wt. + Wt. of Mix (g) [3+4]",null,null,null,{"$f":"IF(E18=\"\",\"\",E20+E21)","v":""},{"$f":"IF(F18=\"\",\"\",F20+F21)","v":""},{"$f":"IF(G18=\"\",\"\",G20+G21)","v":""},"Average",null,"S.G.AC",1.03]
["6.  Final Wt. (g) [Test Complete]"]
["7.  Volume of Mix (cm3) [5-6]",null,null,null,{"$f":"IF(E18=\"\",\"\",E22-E23)","v":""},{"$f":"IF(F18=\"\",\"\",F22-F23)","v":""},{"$f":"IF(G18=\"\",\"\",G22-G23)","v":""},null,null,"E.S.G.A.",{"$f":"IF(H25=\"\",\"\",IF(H28=\"\",(100-B15)/((100/H25)-(B15/K22)),(100-B15)/((100/H28)-(B15/K22))))","v":""}]
["8.  Gmm Without Dry-back (3/7)",null,null,null,{"$f":"IF(E18=\"\",\"\",E20/E24)","v":""},{"$f":"IF(F18=\"\",\"\",F20/F24)","v":""},{"$f":"IF(G18=\"\",\"\",G20/G24)","v":""},{"$f":"IF(E25=\"\",\"\",AVERAGE(E25:G25))","v":""}]
["9.  Volume of Absorbed Water (cm3)"]
["10.  Adjusted Volume of Mix (cm3) [7+9]",null,null,null,{"$f":"IF(E26=\"\",\"\",E24+E26)","v":""},{"$f":"IF(F26=\"\",\"\",F24+F26)","v":""},{"$f":"IF(G26=\"\",\"\",G24+G26)","v":""}]
["11.  Gmm With Dry-back (3/10)",null,null,null,{"$f":"IF(E27=\"\",\"\",E20/E27)","v":""},{"$f":"IF(F27=\"\",\"\",F20/F27)","v":""},{"$f":"IF(G27=\"\",\"\",G20/G27)","v":""},{"$f":"IF(E28=\"\",\"\",AVERAGE(E28:G28))","v":""}]
["Gyratory Specimen Properties"]
["Unit Wt. (lb/ft3) =",null,{"$f":"IF(L17=\"\",\"\",L17)","v":""},"D/A Ratio =",{"$f":"IF($C$33=\"\",\"\",('Design Data'!$T$28/E32))","v":""},"AC (%) =",null,{"$f":"IF(B15=\"\",\"\",B15)","v":""}]
["% Air Voids =",null,{"$f":"IF(E31=\"\",\"\",((+E31-K17)/E31)*100)","v":""},"Gmm =",{"$f":"IF(H28=\"\",H25,H28)","v":""},"% VMA =",null,{"$f":"IF(C33=\"\",\"\",(100-(K17*(100-B15)/C33)))","v":""}]
["% VFA =",null,{"$f":"IF(C31=\"\",\"\",(H31-C31)/H31*100)","v":""},"% Eff. AC =",{"$f":"IF(B15=\"\",\"\",(B15-H32))","v":""},"% Abs. AC (Mix) =",null,{"$f":"IF(E33=\"\",\"\",(K24-K21)/(K24*K21)*K22*(100-E33))","v":""},null,null,null,null,null,null,null," "]
["Gsb =",null,null,"Gse =",{"$f":"K24","v":""},"ESAL Class",null,{"$f":"IF('Design Data'!H20=\"\",\"\",'Design Data'!H20)","v":""}]
[]
["Deviations from Test Method:"]
[null,null,null,null,null,null,null,null,null,null," "]
[null,null,null,null,null,null,null,null,null,null," "]

{"sheet":"Graphs","index":6,"n_rows":170,"n_cols":11,"rows_kept":170,"cut":false,"hidden":false,"merged":[[4,6,4,10],[61,6,61,10],[118,6,118,10]]}
[null,null,null,null,null,"KENTUCKY DEPARTMENT OF HIGHWAYS",null,null,null,null,{"$f":"'Design Data'!U2","v":"October 2022"}]
[null,null,null,null,null,"DIVISION OF MATERIALS"]
[null,null,null,null,null,"Laboratory Mix Design"]
[]
["Mix ID #:",{"$f":"'Design Data'!$H$10","v":0},"County:",{"$f":"'Design Data'!$K$10","v":0},null,"Type Mix:",{"$f":"'Chart Data'!$W$14","v":""}]
["Project Number:",null,{"$f":"'Design Data'!$C$14","v":"Enter Project(s) & Line Item(s)"},null,null,null,null,"Ndes Gyrations:",null,{"$f":"'Design Data'!$Q$88","v":""}]
[null,null,{"$f":"'Design Data'!$C$15","v":"On 'Project Items' Tab."},null,null,null,null,"Lab :",null,{"$f":"'Design Data'!$H$12","v":0}]
["Contractor & Loc.:",null,{"$f":"'Design Data'!$I$15","v":""},null,null,null,null,"Date Completed:",null,{"$f":"IF('Design Data'!$H$86=\"\",'Design Data'!$H$16,'Design Data'!$H$86)","v":"00:00:00"}]
[null,null,null,null,null,null,null,"Date Released:",null,{"$f":"'Design Data'!$H$16","v":"00:00:00"}]
[]
[]
[]
[]
[null,null,null,null,null,null,null,null,"RESULTS:"]
[]
[]
[null,null,null,null,null,null,null,null,"% AC:  "]
[]
[]
[null,null,null,null,null,null,null,null,"% Gmm @ Nini:"]
[]
[]
[null,null,null,null,null,null,null,null,"% Air Voids:"]
[]
[]
[null,null,null,null,null,null,null,null,"% VMA:"]
[]
[]
[null,null,null,null,null,null,null,null,{"$f":"IF(AND(ISNUMBER('Design Data'!H20),'Chart Data'!J48=0.5,'Design Data'!O63<5,'Chart Data'!H48<>20550),\"WARNING: Cannot choose AC%\",IF(AND(ISNUMBER('Design Data'!H20),'Chart Data'!J48=0.38,'Design Data'!O63<5.3),\"WARNING: Cannot choose AC%\",\"\"))","v":""}]
[null,null,null,null,null,null,null,null,{"$f":"IF(AND(ISNUMBER('Design Data'!H20),'Chart Data'!J48=0.5,'Design Data'!O63<5,'Chart Data'!H48<>20550),\"below 5.0% according to\",IF(AND(ISNUMBER('Design Data'!H20),'Chart Data'!J48=0.38,'Design Data'!O63<5.3),\"below 5.3% according to\",\"\"))","v":""}]
[null,null,null,null,null,null,null,null,{"$f":"IF(AND(ISNUMBER('Design Data'!H20),'Chart Data'!J48=0.5,'Design Data'!O63<5,'Chart Data'!H48<>20550),\"current specification.\",IF(AND(ISNUMBER('Design Data'!H20),'Chart Data'!J48=0.38,'Design Data'!O63<5.3),\"current specification.\",\"\"))","v":""}]
[]
[]
[]
[]
[]
[null,null,null,null,null,null,null,null,"REMARKS:"]
[]
[null,null,null,null,null,null,null,null," "]
[null,null,null,null,null,null,null,null," "]
[null,null,null,null,null,null,null,null," "]
[null,null,null,null,null,null,null,null," "]
[null,null,null,null,null,null,null,null," "]
[null,null,null,null,null,null,null,null," "]
[]
[]
[]
[]
[]
[]
[]
[]
[]
[null,null,null,null,null,null,null,null,"Technical Responsibility:"]
[]
[]
[]
[null,null,null,null,null,{"$f":"F1","v":"KENTUCKY DEPARTMENT OF HIGHWAYS"},null,null,null,null,{"$f":"K1","v":"October 2022"}]
[null,null,null,null,null,{"$f":"F2","v":"DIVISION OF MATERIALS"}]
[null,null,null,null,null,{"$f":"F3","v":"Laboratory Mix Design"}]
[]
["Mix ID #:",{"$f":"B5","v":0},"County:",{"$f":"D5","v":0},null,"Type Mix:",{"$f":"G5","v":""}]
["Project Number:",null,{"$f":"C6","v":"Enter Project(s) & Line Item(s)"},null,null,null,null,"Ndes Gyrations:",null,{"$f":"J6","v":""}]
[null,null,{"$f":"C7","v":"On 'Project Items' Tab."},null,null,null,null,"Lab:",null,{"$f":"J7","v":0}]
["Contractor & Loc.:",null,{"$f":"C8","v":""},null,null,null,null,"Date Completed:",null,{"$f":"J8","v":"00:00:00"}]
[null,null,null,null,null,null,null,"Date Released:",null,{"$f":"J9","v":"00:00:00"}]
[]
[]
[]
[]
[null,null,null,null,null,null,null,null,"RESULTS:"]
[]
[]
[null,null,null,null,null,null,null,null,"% AC:  ",null,{"$f":"K17","v":0}]
[]
[]
[null,null,null,null,null,null,null,null,"% VFA:  "]
[]
[]
[null,null,null,null,null,null,null,null,"Unit Weight (pcf):"]
[]
[]
[null,null,null,null,null,null,null,null,"Gmm:"]
[]
[]
[null,null,null,null,null,null,null,null,{"$f":"I29","v":""}]
[null,null,null,null,null,null,null,null,{"$f":"I30","v":""}]
[null,null,null,null,null,null,null,null,{"$f":"I31","v":""}]
[]
[]
[]
[]
[]
[null,null,null,null,null,null,null,null,"REMARKS:"]
[]
[null,null,null,null,null,null,null,null," "]
[null,null,null,null,null,null,null,null," "]
[null,null,null,null,null,null,null,null," "]
[null,null,null,null,null,null,null,null," "]
[null,null,null,null,null,null,null,null," "]
[null,null,null,null,null,null,null,null," "]
[]
[]
[]
[]
[]
[]
[]
[]
[]
[null,null,null,null,null,null,null,null,"Technical Responsibility:"]
[]
[null,null,null,null,null,null,null,null,{"$f":"I56","v":0}]
[]
[null,null,null,null,null,{"$f":"F1","v":"KENTUCKY DEPARTMENT OF HIGHWAYS"},null,null,null,null,{"$f":"K1","v":"October 2022"}]
[null,null,null,null,null,{"$f":"F2","v":"DIVISION OF MATERIALS"}]
[null,null,null,null,null,{"$f":"F3","v":"Laboratory Mix Design"}]
[]
["Mix ID #:",{"$f":"B5","v":0},"County:",{"$f":"D5","v":0},null,"Type Mix:",{"$f":"G5","v":""}]
["Project Number:",null,{"$f":"C6","v":"Enter Project(s) & Line Item(s)"},null,null,null,null,"Ndes Gyrations:",null,{"$f":"J6","v":""}]
[null,null,{"$f":"C7","v":"On 'Project Items' Tab."},null,null,null,null,"Lab:",null,{"$f":"J7","v":0}]
["Contractor & Loc.:",null,{"$f":"C8","v":""},null,null,null,null,"Date Completed:",null,{"$f":"J8","v":"00:00:00"}]
[null,null,null,null,null,null,null,"Date Released:",null,{"$f":"J9","v":"00:00:00"}]
[]
[]
[]
[]
[null,null,null,null,null,null,null,null,"RESULTS:"]
[]
[]
[null,null,null,null,null,null,null,null,"% AC:  ",null,{"$f":"K17","v":0}]
[]
[]
[null,null,null,null,null,null,null,null,"% Eff. AC:",null,{"$f":"'Chart Data'!BL17","v":""}]
[]
[]
[null,null,null,null,null,null,null,null,"Film Thickness (µm):"]
[]
[]
[null,null,null,null,null,null,null,null,"Dust/Asphalt Ratio:  "]
[]
[]
[null,null,null,null,null,null,null,null,{"$f":"I86","v":""}]
[null,null,null,null,null,null,null,null,{"$f":"I87","v":""}]
[null,null,null,null,null,null,null,null,{"$f":"I88","v":""}]
[]
[]
[]
[]
[]
[null,null,null,null,null,null,null,null,"REMARKS:"]
[]
[null,null,null,null,null,null,null,null," "]
[null,null,null,null,null,null,null,null," "]
[null,null,null,null,null,null,null,null," "]
[null,null,null,null,null,null,null,null," "]
[null,null,null,null,null,null,null,null," "]
[null,null,null,null,null,null,null,null," "]
[]
[]
[]
[]
[]
[]
[]
[]
[]
[null,null,null,null,null,null,null,null,"Technical Responsibility:"]
[]
[null,null,null,null,null,null,null,null,{"$f":"I56","v":0}]

{"sheet":"TSR","index":9,"n_rows":59,"n_cols":15,"rows_kept":59,"cut":false,"hidden":false,"merged":[[8,11,9,14],[17,7,17,8],[19,6,19,8],[22,6,22,8],[10,11,11,14],[27,6,27,8],[22,4,22,5],[23,4,23,5],[24,4,24,5],[26,6,26,8],[27,4,27,5],[25,4,25,5],[26,4,26,5],[23,6,23,8],[24,6,24,8],[25,6,25,8],[26,2,26,3],[27,2,27,3],[22,2,22,3],[23,2,23,3],[24,2,24,3],[25,2,25,3]]}
[null,null,null,null,null,null,null,null,null,null,null,null,null,null,{"$f":"'Design Data'!U2","v":"October 2022"}]
["Kentucky Transportation Cabinet, Department of Highways, Division of Materials"]
["Asphalt Mixtures Testing Section"]
["1227 Wilkinson Boulevard, Frankfort, KY  40601-1226"]
[]
[]
["Percentage of Tensile Strength Retained (% TSR) Results"]
[]
["MIX ID #:",{"$f":"IF('Design Data'!H10=\"\",\"\",'Design Data'!H10)","v":""},null,null,null,"COUNTY:",null,{"$f":"IF('Design Data'!K10=\"\",\"\",'Design Data'!K10)","v":""},null,"TYPE OF MIX.:",null,{"$f":"'Chart Data'!W14","v":""}]
[]
["PROJ. #:",{"$f":"IF('Design Data'!C14=\"\",\"\",'Design Data'!C14)","v":"Enter Project(s) & Line Item(s)"},null,null,null,"LAB:",null,{"$f":"IF('Design Data'!H12=\"\",\"\",'Design Data'!H12)","v":""},null,"CONTR. & LOC.:",null,{"$f":"IF('Design Data'!Q14=\"\",\"\",'Design Data'!I15)","v":{"$error":"#N/A"}}]
[null,{"$f":"IF('Design Data'!C15=\"\",\"\",'Design Data'!C15)","v":"On 'Project Items' Tab."}]
["BIND. GRADE:",{"$f":"IF('Design Data'!C18=\"\",\"\",'Design Data'!C18)","v":""},null,null,null,"TSRs made with:",null,{"$f":"IF('Chart Data'!AJ37=\"\",\"\",'Chart Data'!AJ37)","v":""},null,"TEST METHOD:",null,"ASTM D4867"]
["(as per bid item)"]
["BIND. SOURCE:",{"$f":"IF('Design Data'!H18=\"\",\"\",'Design Data'!A17)","v":""},null,null,null,"MIX/COMP TEMP:",null,{"$f":"IF(H13=\"\",\"\",VLOOKUP(H13,'Chart Data'!J33:K36,2,FALSE))","v":""},null,null,"Test Specimen Results"]
[null,null,null,null,null,null,null,null,null,null,"Sample Identification"]
[{"$f":"IF(B31=150,\"TSR specimens are to be compacted to a height\",\"TSR specimens are to be compacted by the\")","v":"TSR specimens are to be compacted to a height"},null,null,null,null,null,"% AC:","% ADDITIVE:",null,null,"Sample Aggregate Weight (g)"]
[{"$f":"IF(B31=150,\"of 95.0 mm with a target air void percentage of\",\"amount of blows that will yeild 7.0% (+ or - 1.0%)\")","v":"of 95.0 mm with a target air void percentage of"},null,null,null,null,null,null,null,null,null,"Grams of Asphalt Binder (g)",null,null,{"$f":"IF(N17=\"\",\"\",(($G$18)*N17)/(100-($G$18)))","v":""},{"$f":"IF(O17=\"\",\"\",(($G$18)*O17)/(100-($G$18)))","v":""}]
[{"$f":"IF(B31=150,\"7.0 % (+ or - 1.0 %).  The target degree of initial\",\"air voids.  The target degree of initial saturation\")","v":"7.0 % (+ or - 1.0 %).  The target degree of initial"},null,null,null,null,null,"TYPE OF ADDITIVE:",null,null,null,"Dry Weight in Air (g)"]
[{"$f":"IF(B31=150,\"saturation is 65.0% (+ or - 5.0 %).\",\"is 65.0% (+ or - 5.0%)\")","v":"saturation is 65.0% (+ or - 5.0 %)."},null,null,null,null,null,null,null,null,null,"Weight in Water (g)"]
[null,null,null,null,null,null,null,null,null,null,"SSD Weight (g)"]
["Process",null,"Date:",null,"Time:",null,null,"By:",null,null,"Bulk Volume (cm3)",null,null,{"$f":"IF(N21=\"\",\"\",N21-N20)","v":""},{"$f":"IF(O21=\"\",\"\",O21-O20)","v":""}]
["TSR's Made:",null,null,null,null,null,null,null,null,null,"Bulk Specific Gravity",null,null,{"$f":"IF(N22=\"\",\"\",(N19/N22))","v":""},{"$f":"IF(O22=\"\",\"\",(O19/O22))","v":""}]
["TSR's Bulked:",null,null,null,null,null,null,null,null,null,"Maximum Specific Gravity",null,null,null,{"$f":"IF(N24=\"\",\"\",N24)","v":""}]
["TSR's Saturated:",null,null,null,null,null,null,null,null,null,"% Air Voids",null,null,{"$f":"IF(N21=\"\",\"\",(100*(N24-N23)/N24))","v":""},{"$f":"IF(O21=\"\",\"\",(100*(O24-O23)/O24))","v":""}]
["TSR's in Freezer:",null,null,null,null,null,null,null,null,null,"Target % Air Voids",null,null,{"$f":"IF(N24=\"\",\"\",7)","v":""},{"$f":"IF(N24=\"\",\"\",\"%\")","v":""}]
["TSR's in 140oF Bath:",null,null,null,null,null,null,null,null,null,"Target Aggregate Weight (g)",null,null,{"$f":"IF($N$21=\"\",\"\",(N17+(((N25-N26)/(N25-O25))*(O17-N17))))","v":""}]
["TSR's Broken :",null,null,null,null,null,null,null,null,null,"Asphalt Binder (g)",null,null,{"$f":"IF(N27=\"\",\"\",(($G$18)*N27)/(100-($G$18)))","v":""}]
[]
["Sample ID",1,2,3,4,5,6,"Average",7,8,9,10,11,12,"Average"]
["Diameter (mm)",150,{"$f":"$B$31","v":150},{"$f":"$B$31","v":150},{"$f":"$B$31","v":150},{"$f":"$B$31","v":150},{"$f":"$B$31","v":150},null,{"$f":"$B$31","v":150},150,150,150,150,150]
["Thickness (mm)"]
["Dry Weight (g)"]
["SSD Weight (g)"]
["Wt. in Water (g)"]
["Volume (cm3)",{"$f":"IF(B34=\"\",\"\",B34-B35)","v":""},"","","","","",null,{"$f":"IF(I34=\"\",\"\",I34-I35)","v":""},"","","","",""]
["Bulk Spec. Gravity",{"$f":"IF(B36=\"\",\"\",(B33/B36))","v":""},"","","","","",null,{"$f":"IF(I36=\"\",\"\",(I33/I36))","v":""},"","","","",""]
["Max. Sp. Gravity",null,{"$f":"IF(C35=\"\",\"\",$B$38)","v":""},{"$f":"IF(D35=\"\",\"\",$B$38)","v":""},{"$f":"IF(E35=\"\",\"\",$B$38)","v":""},{"$f":"IF(F35=\"\",\"\",$B$38)","v":""},{"$f":"IF(G35=\"\",\"\",$B$38)","v":""},null,{"$f":"IF(I35=\"\",\"\",$B$38)","v":""},"","","","",""]
["% Air Voids",{"$f":"IF(B37=\"\",\"\",(100*(B38-B37)/B38))","v":""},"","","","","",{"$f":"IF(B39=\"\",\"\",(AVERAGE(B39:G39)))","v":""},{"$f":"IF(I37=\"\",\"\",(100*(I38-I37)/I38))","v":""},"","","","","",{"$f":"IF(I39=\"\",\"\",(AVERAGE(I39:N39)))","v":""}]
["Vol. Air Voids (cm3)",{"$f":"IF(B39=\"\",\"\",(B39*B36/100))","v":""},"","","","","",null,{"$f":"IF(I39=\"\",\"\",(I39*I36/100))","v":""},"","","","",""]
["Load (lbf)"]
["Saturated"]
["Sample ID",{"$f":"B30","v":1},2,3,4,5,6,"Average",{"$f":"I30","v":7},8,9,10,11,12,"Average"]
["SSD Weight (g)"]
["Vol. Abs. Wat. (cm3)",{"$f":"IF(B44-B34>0,B44-B33,\" \")","v":" "}," "," "," "," "," ",null,{"$f":"IF(I44-I34>0,I44-I33,\" \")","v":" "}," "," "," "," "," "]
["% Saturation",{"$f":"IF(ISNUMBER(B45),100*B45/B40,\" \")","v":" "}," "," "," "," "," ",{"$f":"IF(ISERROR(AVERAGE(B46:G46)),\"\",AVERAGE(B46:G46))","v":""},{"$f":"IF(ISNUMBER(I45),100*I45/I40,\" \")","v":" "}," "," "," "," "," ",{"$f":"IF(ISERROR(AVERAGE(I46:N46)),\"\",AVERAGE(I46:N46))","v":""}]
["Conditioned 24 hrs. in 140 oF water"]
["Sample ID",{"$f":"B43","v":1},2,3,4,5,6,"Average",{"$f":"I43","v":7},8,9,10,11,12,"Average"]
["Thickness (mm)"]
["SSD Weight (g)"]
["Vol. Abs. Wat. (cm3)",{"$f":"IF(B50-B34>0,B50-B33,\" \")","v":" "}," "," "," "," "," ",null,{"$f":"IF(I50-I34>0,I50-I33,\" \")","v":" "}," "," "," "," "," "]
["% Saturation",{"$f":"IF(ISNUMBER(B51),100*B51/B40,\" \")","v":" "}," "," "," "," "," ",{"$f":"IF(ISERROR(AVERAGE(B52:G52)),\"\",AVERAGE(B52:G52))","v":""},{"$f":"IF(ISNUMBER(I51),100*I51/I40,\" \")","v":" "}," "," "," "," "," ",{"$f":"IF(ISERROR(AVERAGE(I52:N52)),\"\",AVERAGE(I52:N52))","v":""}]
["Load (lbf)"]
["Wet Strength (psi)",{"$f":"IF(B49=\"\",\"\",((2*B53)/((B31/25.4)*(B49/25.4)*PI())))","v":""},"","","","","",{"$f":"IF(ISERROR(AVERAGE(B54:G54)),\"\",AVERAGE(B54:G54))","v":""},{"$f":"IF(I49=\"\",\"\",((2*I53)/((I31/25.4)*(I49/25.4)*PI())))","v":""},"","","","","",{"$f":"IF(ISERROR(AVERAGE(I54:N54)),\"\",AVERAGE(I54:N54))","v":""}]
["Dry Strength (psi)",{"$f":"IF(ISNUMBER(B41),(IF(ISNUMBER(B49),\"\",IF((2*B41)/((B31/25.4)*(B32/25.4)*PI())>0,(2*B41)/((B31/25.4)*(B32/25.4)*PI()),\" \"))),\"\")","v":""},"","","","","",{"$f":"IF(ISERROR(AVERAGE(B55:G55)),\"\",AVERAGE(B55:G55))","v":""},{"$f":"IF(ISNUMBER(I41),(IF(ISNUMBER(I49),\"\",IF((2*I41)/((I31/25.4)*(I32/25.4)*PI())>0,(2*I41)/((I31/25.4)*(I32/25.4)*PI()),\" \"))),\"\")","v":""},"","","","","",{"$f":"IF(ISERROR(AVERAGE(I55:N55)),\"\",AVERAGE(I55:N55))","v":""}]
[]
[null,null,"% TSR Without Additive = ",null,null,null,{"$f":"IF(H54=\"\",\"\",(H54/H55*100))","v":""},null,null,"% TSR With Additive = ",null,null,null,{"$f":"IF(O54=\"\",\"\",(O54/O55*100))","v":""}]
[]
["REMARKS:"]

{"sheet":"Performance Specimens","index":10,"n_rows":43,"n_cols":15,"rows_kept":43,"cut":false,"hidden":true,"merged":[[25,13,25,14],[26,13,26,14],[27,13,27,14],[29,6,29,8],[27,2,27,3],[27,4,27,5],[27,6,27,8],[28,6,28,8],[28,4,28,5],[28,2,28,3],[25,2,25,3],[25,4,25,5],[25,6,25,8],[26,2,26,3],[26,4,26,5],[26,6,26,8],[23,2,23,3],[23,4,23,5],[23,6,23,8],[24,2,24,3],[24,4,24,5],[24,6,24,8],[8,11,9,14],[10,11,11,14],[17,7,17,8],[19,6,19,8],[22,2,22,3],[22,4,22,5],[22,6,22,8]]}
[null,null,null,null,null,null,null,null,null,null,null,null,null,null,{"$f":"'Design Data'!U2","v":"October 2022"}]
["Kentucky Transportation Cabinet, Department of Highways, Division of Materials"]
["Asphalt Mixtures Testing Section"]
["1227 Wilkinson Boulevard, Frankfort, KY  40601-1226"]
[]
[]
["Performance Specimen Fabrication Results"]
[]
["MIX ID #:",{"$f":"IF('Design Data'!H10=\"\",\"\",'Design Data'!H10)","v":""},null,null,null,"COUNTY:",null,{"$f":"IF('Design Data'!K10=\"\",\"\",'Design Data'!K10)","v":""},null,"TYPE OF MIX.:",null,{"$f":"'Chart Data'!W14","v":""}]
[]
["PROJ. #:",{"$f":"IF('Design Data'!C14=\"\",\"\",'Design Data'!C14)","v":"Enter Project(s) & Line Item(s)"},null,null,null,"LAB:",null,{"$f":"IF('Design Data'!H12=\"\",\"\",'Design Data'!H12)","v":""},null,"CONTR. & LOC.:",null,{"$f":"IF('Design Data'!Q14=\"\",\"\",'Design Data'!I15)","v":{"$error":"#N/A"}}]
[null,{"$f":"IF('Design Data'!C15=\"\",\"\",'Design Data'!C15)","v":"On 'Project Items' Tab."}]
["BIND. GRADE:",{"$f":"IF('Design Data'!C18=\"\",\"\",'Design Data'!C18)","v":""},null,null,null,"MADE WITH:",null,{"$f":"IF('Chart Data'!AJ37=\"\",\"\",'Chart Data'!AJ37)","v":""}]
["(as per bid item)"]
["BIND. SOURCE:",{"$f":"IF('Design Data'!H18=\"\",\"\",'Design Data'!A17)","v":""},null,null,null,"MIX/COMP TEMP:",null,{"$f":"IF(H13=\"\",\"\",VLOOKUP(H13,'Chart Data'!J33:K36,2,FALSE))","v":""},null,null,"Test Specimen Results"]
[null,null,null,null,null,null,null,null,null,null,"Sample Identification"]
[{"$f":"IF(B33=150,\"Performance specimens are to be compacted to a\",\"TSR specimens are to be compacted by the\")","v":"Performance specimens are to be compacted to a"},null,null,null,null,null,"% AC:","% ADDITIVE:",null,null,"Sample Aggregate Weight (g)"]
[{"$f":"IF(B33=150,\"height of 62.0 mm with a target air void percentage\",\"amount of blows that will yeild 7.0% (+ or - 1.0%)\")","v":"height of 62.0 mm with a target air void percentage"},null,null,null,null,null,null,null,null,null,"Grams of Asphalt Binder (g)",null,null,{"$f":"IF(N17=\"\",\"\",(($G$18)*N17)/(100-($G$18)))","v":""},{"$f":"IF(O17=\"\",\"\",(($G$18)*O17)/(100-($G$18)))","v":""}]
[{"$f":"IF(B33=150,\"of 7.0 % (+ or - 0.5 %).\",\"air voids.  The target degree of initial saturation\")","v":"of 7.0 % (+ or - 0.5 %)."},null,null,null,null,null,"TYPE OF ADDITIVE:",null,null,null,"Dry Weight in Air (g)"]
[{"$f":"IF(B33=150,\"\",\"is 65.0% (+ or - 5.0%)\")","v":""},null,null,null,null,null,null,null,null,null,"Weight in Water (g)"]
[null,null,null,null,null,null,null,null,null,null,"SSD Weight (g)"]
["Lab Process",null,"Date:",null,"Time:",null,null,"By:",null,null,"Bulk Volume (cm3)",null,null,{"$f":"IF(N21=\"\",\"\",N21-N20)","v":""},{"$f":"IF(O21=\"\",\"\",O21-O20)","v":""}]
["Specimens Mixed:",null,null,null,null,null,null,null,null,null,"Bulk Specific Gravity",null,null,{"$f":"IF(N22=\"\",\"\",(N19/N22))","v":""},{"$f":"IF(O22=\"\",\"\",(O19/O22))","v":""}]
["Specimens Oven Conditioned:",null,null,null,null,null,null,null,null,null,"Maximum Specific Gravity",null,null,null,{"$f":"IF(N24=\"\",\"\",N24)","v":""}]
["Specimens Made:",null,null,null,null,null,null,null,null,null,"% Air Voids",null,null,{"$f":"IF(N21=\"\",\"\",(100*(N24-N23)/N24))","v":""},{"$f":"IF(O21=\"\",\"\",(100*(O24-O23)/O24))","v":""}]
["Specimens Bulked:",null,null,null,null,null,null,null,null,null,"Target % Air Voids",null,null,{"$f":"IF(N24=\"\",\"\",7)","v":""}]
["CT Specimens in 77 °F Bath:",null,null,null,null,null,null,null,null,null,"Target Aggregate Weight (g)",null,null,{"$f":"IF($N$21=\"\",\"\",(N17+(((N25-N26)/(N25-O25))*(O17-N17))))","v":""}]
["CT Specimens Broken:",null,null,null,null,null,null,null,null,null,"Asphalt Binder (g)",null,null,{"$f":"IF(N27=\"\",\"\",(($G$18)*N27)/(100-($G$18)))","v":""}]
["Hamburg Specimens in Bath:"]
["Hamburg Specimens Run:"]
[]
["Sample ID",1,2,3,4,5,6,"Average",7,8,9,10,11,12,"Average"]
["Diameter (mm)",150,{"$f":"$B$33","v":150},{"$f":"$B$33","v":150},{"$f":"$B$33","v":150},{"$f":"$B$33","v":150},{"$f":"$B$33","v":150},null,{"$f":"$B$33","v":150},150,150,150,150,150]
["Thickness (mm)"]
["Dry Weight (g)"]
["SSD Weight (g)"]
["Wt. in Water (g)"]
["Volume (cm3)",{"$f":"IF(B36=\"\",\"\",B36-B37)","v":""},"","","","","",null,{"$f":"IF(I36=\"\",\"\",I36-I37)","v":""},"","","","",""]
["Bulk Spec. Gravity",{"$f":"IF(B38=\"\",\"\",(B35/B38))","v":""},"","","","","",null,{"$f":"IF(I38=\"\",\"\",(I35/I38))","v":""},"","","","",""]
["Max. Sp. Gravity",null,{"$f":"IF(C37=\"\",\"\",$B$40)","v":""},{"$f":"IF(D37=\"\",\"\",$B$40)","v":""},{"$f":"IF(E37=\"\",\"\",$B$40)","v":""},{"$f":"IF(F37=\"\",\"\",$B$40)","v":""},{"$f":"IF(G37=\"\",\"\",$B$40)","v":""},null,{"$f":"IF(I37=\"\",\"\",$B$40)","v":""},"","","","",""]
["% Air Voids",{"$f":"IF(B39=\"\",\"\",(100*(B40-B39)/B40))","v":""},"","","","","",{"$f":"IF(B41=\"\",\"\",(AVERAGE(B41:G41)))","v":""},{"$f":"IF(I39=\"\",\"\",(100*(I40-I39)/I40))","v":""},"","","","","",{"$f":"IF(I41=\"\",\"\",(AVERAGE(I41:N41)))","v":""}]
[]
["REMARKS:"]

{"sheet":"KYCT Data","index":11,"n_rows":1031,"n_cols":25,"rows_kept":1031,"cut":false,"hidden":true,"merged":[[3,1,3,15],[26,0,26,15],[27,0,27,1],[27,2,27,3],[27,4,27,5],[27,6,27,7],[27,8,27,9],[27,10,27,11],[27,12,27,13],[27,14,27,15]]}
["V1.03","  850 - IDEAL-CT",null,null,null,null,null,null,null,null,null,null,null,null,null,{"$f":"'Design Data'!U2","v":"October 2022"}]
[]
[null,null,null,null,null,null,null,null,null,null,null,null,null,null,null,"Show/Hide Formula Rows",null,null,null,null,null,null,null,"Test Number",1]
["Project ID",null,null,null,null,null,null,null,null,null,null,null,null,null,null,null,null,null,null,null,null,null,null,{"$f":"B4","v":0}]
["Num Points",{"$f":"COUNTA(INDIRECT(\"A\"&FirstRow&\":A\"&FirstRow+1000))","v":0},"Num Points",{"$f":"COUNTA(INDIRECT(\"C\"&FirstRow&\":C\"&FirstRow+1000))","v":0},"Num Points",{"$f":"COUNTA(INDIRECT(\"E\"&FirstRow&\":E\"&FirstRow+1000))","v":0},"Num Points",{"$f":"COUNTA(INDIRECT(\"G\"&FirstRow&\":G\"&FirstRow+1000))","v":0},"Num Points",{"$f":"COUNTA(INDIRECT(\"I\"&FirstRow&\":I\"&FirstRow+1000))","v":0},"Num Points",{"$f":"COUNTA(INDIRECT(\"K\"&FirstRow&\":K\"&FirstRow+1000))","v":0},"Num Points",{"$f":"COUNTA(INDIRECT(\"M\"&FirstRow&\":M\"&FirstRow+1000))","v":0},"Num Points",{"$f":"COUNTA(INDIRECT(\"O\"&FirstRow&\":O\"&FirstRow+1000))","v":0},null,null,null,null,null,null,null,{"$f":"IF(OFFSET(A5:P1031,0,(TestNum-1)*2)=\"\",NA(),OFFSET(A5:P1031,0,(TestNum-1)*2))","v":{"$error":"#NAME?"}},{"$error":"#NAME?"}]
["Peak Load",{"$f":"MAX(INDIRECT(\"B\"&FirstRow&\":B\"&FirstRow+B5))","v":0},"Peak Load",{"$f":"MAX(INDIRECT(\"D\"&FirstRow&\":D\"&FirstRow+D5))","v":0},"Peak Load",{"$f":"MAX(INDIRECT(\"F\"&FirstRow&\":F\"&FirstRow+F5))","v":0},"Peak Load",{"$f":"MAX(INDIRECT(\"H\"&FirstRow&\":H\"&FirstRow+H5))","v":0},"Peak Load",{"$f":"MAX(INDIRECT(\"J\"&FirstRow&\":J\"&FirstRow+J5))","v":0},"Peak Load",{"$f":"MAX(INDIRECT(\"L\"&FirstRow&\":L\"&FirstRow+L5))","v":0},"Peak Load",{"$f":"MAX(INDIRECT(\"N\"&FirstRow&\":N\"&FirstRow+N5))","v":0},"Peak Load",{"$f":"MAX(INDIRECT(\"P\"&FirstRow&\":P\"&FirstRow+P5))","v":0},null,"First Row of Data",31,null,null,null,null,{"$error":"#NAME?"},{"$error":"#NAME?"}]
["85% Peak",{"$f":"0.85*B6","v":0},"85% Peak",{"$f":"0.85*D6","v":0},"85% Peak",{"$f":"0.85*F6","v":0},"85% Peak",{"$f":"0.85*H6","v":0},"85% Peak",{"$f":"0.85*J6","v":0},"85% Peak",{"$f":"0.85*L6","v":0},"85% Peak",{"$f":"0.85*N6","v":0},"85% Peak",{"$f":"0.85*P6","v":0},null,null,null,null,null,null,null,{"$error":"#NAME?"},{"$error":"#NAME?"}]
["75% Peak",{"$f":"0.75*B6","v":0},"75% Peak",{"$f":"0.75*D6","v":0},"75% Peak",{"$f":"0.75*F6","v":0},"75% Peak",{"$f":"0.75*H6","v":0},"75% Peak",{"$f":"0.75*J6","v":0},"75% Peak",{"$f":"0.75*L6","v":0},"75% Peak",{"$f":"0.75*N6","v":0},"75% Peak",{"$f":"0.75*P6","v":0},null,null,null,null,null,null,null,{"$error":"#NAME?"},{"$error":"#NAME?"}]
["65% Peak",{"$f":"0.65*B6","v":0},"65% Peak",{"$f":"0.65*D6","v":0},"65% Peak",{"$f":"0.65*F6","v":0},"65% Peak",{"$f":"0.65*H6","v":0},"65% Peak",{"$f":"0.65*J6","v":0},"65% Peak",{"$f":"0.65*L6","v":0},"65% Peak",{"$f":"0.65*N6","v":0},"65% Peak",{"$f":"0.65*P6","v":0},null,null,null,null,null,null,null,{"$error":"#NAME?"},{"$error":"#NAME?"}]
["Rowpeak",{"$f":"MATCH(B6,INDIRECT(\"B\"&FirstRow&\":B\"&FirstRow+B5),0)+FirstRow-1","v":{"$error":"#N/A"}},"Rowpeak",{"$f":"MATCH(D6,INDIRECT(\"D\"&FirstRow&\":D\"&FirstRow+D5),0)+FirstRow-1","v":{"$error":"#N/A"}},"Rowpeak",{"$f":"MATCH(F6,INDIRECT(\"F\"&FirstRow&\":F\"&FirstRow+F5),0)+FirstRow-1","v":{"$error":"#N/A"}},"Rowpeak",{"$f":"MATCH(H6,INDIRECT(\"H\"&FirstRow&\":H\"&FirstRow+H5),0)+FirstRow-1","v":{"$error":"#N/A"}},"Rowpeak",{"$f":"MATCH(J6,INDIRECT(\"J\"&FirstRow&\":J\"&FirstRow+J5),0)+FirstRow-1","v":{"$error":"#N/A"}},"Rowpeak",{"$f":"MATCH(L6,INDIRECT(\"L\"&FirstRow&\":L\"&FirstRow+L5),0)+FirstRow-1","v":{"$error":"#N/A"}},"Rowpeak",{"$f":"MATCH(N6,INDIRECT(\"N\"&FirstRow&\":N\"&FirstRow+N5),0)+FirstRow-1","v":{"$error":"#N/A"}},"Rowpeak",{"$f":"MATCH(P6,INDIRECT(\"P\"&FirstRow&\":P\"&FirstRow+P5),0)+FirstRow-1","v":{"$error":"#N/A"}},null,null,null,null,null,null,null,{"$error":"#NAME?"},{"$error":"#NAME?"}]
["Row(85)",{"$f":"MATCH(B7,INDIRECT(\"B\"&B10&\":B\"&FirstRow+B5),-1)+B10","v":{"$error":"#N/A"}},"Row(85)",{"$f":"MATCH(D7,INDIRECT(\"D\"&D10&\":D\"&FirstRow+D5),-1)+D10","v":{"$error":"#N/A"}},"Row(85)",{"$f":"MATCH(F7,INDIRECT(\"F\"&F10&\":F\"&FirstRow+F5),-1)+F10","v":{"$error":"#N/A"}},"Row(85)",{"$f":"MATCH(H7,INDIRECT(\"H\"&H10&\":H\"&FirstRow+H5),-1)+H10","v":{"$error":"#N/A"}},"Row(85)",{"$f":"MATCH(J7,INDIRECT(\"J\"&J10&\":J\"&FirstRow+J5),-1)+J10","v":{"$error":"#N/A"}},"Row(85)",{"$f":"MATCH(L7,INDIRECT(\"L\"&L10&\":L\"&FirstRow+L5),-1)+L10","v":{"$error":"#N/A"}},"Row(85)",{"$f":"MATCH(N7,INDIRECT(\"N\"&N10&\":N\"&FirstRow+N5),-1)+N10","v":{"$error":"#N/A"}},"Row(85)",{"$f":"MATCH(P7,INDIRECT(\"P\"&P10&\":P\"&FirstRow+P5),-1)+P10","v":{"$error":"#N/A"}},null,null,null,null,null,null,null,{"$error":"#NAME?"},{"$error":"#NAME?"}]
["Row(75)",{"$f":"MATCH(B8,INDIRECT(\"B\"&B10&\":B\"&FirstRow+B5),-1)+B10","v":{"$error":"#N/A"}},"Row(75)",{"$f":"MATCH(D8,INDIRECT(\"D\"&D10&\":D\"&FirstRow+D5),-1)+D10","v":{"$error":"#N/A"}},"Row(75)",{"$f":"MATCH(F8,INDIRECT(\"F\"&F10&\":F\"&FirstRow+F5),-1)+F10","v":{"$error":"#N/A"}},"Row(75)",{"$f":"MATCH(H8,INDIRECT(\"H\"&H10&\":H\"&FirstRow+H5),-1)+H10","v":{"$error":"#N/A"}},"Row(75)",{"$f":"MATCH(J8,INDIRECT(\"J\"&J10&\":J\"&FirstRow+J5),-1)+J10","v":{"$error":"#N/A"}},"Row(75)",{"$f":"MATCH(L8,INDIRECT(\"L\"&L10&\":L\"&FirstRow+L5),-1)+L10","v":{"$error":"#N/A"}},"Row(75)",{"$f":"MATCH(N8,INDIRECT(\"N\"&N10&\":N\"&FirstRow+N5),-1)+N10","v":{"$error":"#N/A"}},"Row(75)",{"$f":"MATCH(P8,INDIRECT(\"P\"&P10&\":P\"&FirstRow+P5),-1)+P10","v":{"$error":"#N/A"}},null,null,null,null,null,null,null,{"$error":"#NAME?"},{"$error":"#NAME?"}]
["Row(65)",{"$f":"MATCH(B9,INDIRECT(\"B\"&B10&\":B\"&FirstRow+B5),-1)+B10","v":{"$error":"#N/A"}},"Row(65)",{"$f":"MATCH(D9,INDIRECT(\"D\"&D10&\":D\"&FirstRow+D5),-1)+D10","v":{"$error":"#N/A"}},"Row(65)",{"$f":"MATCH(F9,INDIRECT(\"F\"&F10&\":F\"&FirstRow+F5),-1)+F10","v":{"$error":"#N/A"}},"Row(65)",{"$f":"MATCH(H9,INDIRECT(\"H\"&H10&\":H\"&FirstRow+H5),-1)+H10","v":{"$error":"#N/A"}},"Row(65)",{"$f":"MATCH(J9,INDIRECT(\"J\"&J10&\":J\"&FirstRow+J5),-1)+J10","v":{"$error":"#N/A"}},"Row(65)",{"$f":"MATCH(L9,INDIRECT(\"L\"&L10&\":L\"&FirstRow+L5),-1)+L10","v":{"$error":"#N/A"}},"Row(65)",{"$f":"MATCH(N9,INDIRECT(\"N\"&N10&\":N\"&FirstRow+N5),-1)+N10","v":{"$error":"#N/A"}},"Row(65)",{"$f":"MATCH(P9,INDIRECT(\"P\"&P10&\":P\"&FirstRow+P5),-1)+P10","v":{"$error":"#N/A"}},null,null,null,null,null,null,null,{"$error":"#NAME?"},{"$error":"#NAME?"}]
["l75",{"$f":"IF(ISNA(B12),\"\",INDIRECT(\"A\"&B12))","v":""},"l75",{"$f":"IF(ISNA(D12),\"\",INDIRECT(\"C\"&D12))","v":""},"l75",{"$f":"IF(ISNA(F12),\"\",INDIRECT(\"E\"&F12))","v":""},"l75",{"$f":"IF(ISNA(H12),\"\",INDIRECT(\"G\"&H12))","v":""},"l75",{"$f":"IF(ISNA(J12),\"\",INDIRECT(\"I\"&J12))","v":""},"l75",{"$f":"IF(ISNA(L12),\"\",INDIRECT(\"K\"&L12))","v":""},"l75",{"$f":"IF(ISNA(N12),\"\",INDIRECT(\"M\"&N12))","v":""},"l75",{"$f":"IF(ISNA(P12),\"\",INDIRECT(\"O\"&P12))","v":""},null,null,null,null,null,null,null,{"$error":"#NAME?"},{"$error":"#NAME?"}]
["m",{"$f":"ABS(SLOPE((INDEX(B:B,B11):INDEX(B:B,B13)),(INDEX(A:A,B11):INDEX(A:A,B13))))","v":{"$error":"#N/A"}},"m",{"$f":"ABS(SLOPE((INDEX(D:D,D11):INDEX(D:D,D13)),(INDEX(C:C,D11):INDEX(C:C,D13))))","v":{"$error":"#N/A"}},"m",{"$f":"ABS(SLOPE((INDEX(F:F,F11):INDEX(F:F,F13)),(INDEX(E:E,F11):INDEX(E:E,F13))))","v":{"$error":"#N/A"}},"m",{"$f":"ABS(SLOPE((INDEX(H:H,H11):INDEX(H:H,H13)),(INDEX(G:G,H11):INDEX(G:G,H13))))","v":{"$error":"#N/A"}},"m",{"$f":"ABS(SLOPE((INDEX(J:J,J11):INDEX(J:J,J13)),(INDEX(I:I,J11):INDEX(I:I,J13))))","v":{"$error":"#N/A"}},"m",{"$f":"ABS(SLOPE((INDEX(L:L,L11):INDEX(L:L,L13)),(INDEX(K:K,L11):INDEX(K:K,L13))))","v":{"$error":"#N/A"}},"m",{"$f":"ABS(SLOPE((INDEX(N:N,N11):INDEX(N:N,N13)),(INDEX(M:M,N11):INDEX(M:M,N13))))","v":{"$error":"#N/A"}},"m",{"$f":"ABS(SLOPE((INDEX(P:P,P11):INDEX(P:P,P13)),(INDEX(O:O,P11):INDEX(O:O,P13))))","v":{"$error":"#N/A"}},null,null,null,null,null,null,null,{"$error":"#NAME?"},{"$error":"#NAME?"}]
["Series Name",{"$f":"IF(ISBLANK(B22),IF(ISBLANK(A28),\"\",A28),B22)","v":""},"Series Name",{"$f":"IF(ISBLANK(D22),IF(ISBLANK(C28),\"\",C28),D22)","v":""},"Series Name",{"$f":"IF(ISBLANK(F22),IF(ISBLANK(E28),\"\",E28),F22)","v":""},"Series Name",{"$f":"IF(ISBLANK(H22),IF(ISBLANK(G28),\"\",G28),H22)","v":""},"Series Name",{"$f":"IF(ISBLANK(J22),IF(ISBLANK(I28),\"\",I28),J22)","v":""},"Series Name",{"$f":"IF(ISBLANK(L22),IF(ISBLANK(K28),\"\",K28),L22)","v":""},"Series Name",{"$f":"IF(ISBLANK(N22),IF(ISBLANK(M28),\"\",M28),N22)","v":""},"Series Name",{"$f":"IF(ISBLANK(P22),IF(ISBLANK(O28),\"\",O28),P22)","v":""},null,null,null,null,null,null,null,{"$error":"#NAME?"},{"$error":"#NAME?"}]
["Row < 0.1",{"$f":"MATCH(0.1,INDIRECT(\"B\"&B10&\":B\"&FirstRow+B5),-1)+B10","v":{"$error":"#N/A"}},"Row < 0.1",{"$f":"MATCH(0.1,INDIRECT(\"D\"&D10&\":D\"&FirstRow+D5),-1)+D10","v":{"$error":"#N/A"}},"Row < 0.1",{"$f":"MATCH(0.1,INDIRECT(\"F\"&F10&\":F\"&FirstRow+F5),-1)+F10","v":{"$error":"#N/A"}},"Row < 0.1",{"$f":"MATCH(0.1,INDIRECT(\"H\"&H10&\":H\"&FirstRow+H5),-1)+H10","v":{"$error":"#N/A"}},"Row < 0.1",{"$f":"MATCH(0.1,INDIRECT(\"J\"&J10&\":J\"&FirstRow+J5),-1)+J10","v":{"$error":"#N/A"}},"Row < 0.1",{"$f":"MATCH(0.1,INDIRECT(\"L\"&L10&\":L\"&FirstRow+L5),-1)+L10","v":{"$error":"#N/A"}},"Row < 0.1",{"$f":"MATCH(0.1,INDIRECT(\"N\"&N10&\":N\"&FirstRow+N5),-1)+N10","v":{"$error":"#N/A"}},"Row < 0.1",{"$f":"MATCH(0.1,INDIRECT(\"P\"&P10&\":P\"&FirstRow+P5),-1)+P10","v":{"$error":"#N/A"}},null,null,null,null,null,null,null,{"$error":"#NAME?"},{"$error":"#NAME?"}]
["m75",{"$f":"IF(ISERROR(B15),\"\",ABS(B15))","v":""},"m75",{"$f":"IF(ISERROR(D15),\"\",ABS(D15))","v":""},"m75",{"$f":"IF(ISERROR(F15),\"\",ABS(F15))","v":""},"m75",{"$f":"IF(ISERROR(H15),\"\",ABS(H15))","v":""},"m75",{"$f":"IF(ISERROR(J15),\"\",ABS(J15))","v":""},"m75",{"$f":"IF(ISERROR(L15),\"\",ABS(L15))","v":""},"m75",{"$f":"IF(ISERROR(N15),\"\",ABS(N15))","v":""},"m75",{"$f":"IF(ISERROR(P15),\"\",ABS(P15))","v":""},null,null,null,null,null,null,null,{"$error":"#NAME?"},{"$error":"#NAME?"}]
["Wf",{"$f":"IF(ISNA(B17),\"\",SUMPRODUCT((INDIRECT(\"A\"&FirstRow+1&\":A\"&B17))-(INDIRECT(\"A\"&FirstRow&\":A\"&B17-1)),(((INDIRECT(\"B\"&FirstRow+1&\":B\"&B17))+(INDIRECT(\"B\"&FirstRow&\":B\"&B17-1)))/2)))","v":""},"Wf",{"$f":"IF(ISNA(D17),\"\",SUMPRODUCT((INDIRECT(\"C\"&FirstRow+1&\":C\"&D17))-(INDIRECT(\"C\"&FirstRow&\":C\"&D17-1)),(((INDIRECT(\"D\"&FirstRow+1&\":D\"&D17))+(INDIRECT(\"D\"&FirstRow&\":D\"&D17-1)))/2)))","v":""},"Wf",{"$f":"IF(ISNA(F17),\"\",SUMPRODUCT((INDIRECT(\"E\"&FirstRow+1&\":E\"&F17))-(INDIRECT(\"E\"&FirstRow&\":E\"&F17-1)),(((INDIRECT(\"F\"&FirstRow+1&\":F\"&F17))+(INDIRECT(\"F\"&FirstRow&\":F\"&F17-1)))/2)))","v":""},"Wf",{"$f":"IF(ISNA(H17),\"\",SUMPRODUCT((INDIRECT(\"G\"&FirstRow+1&\":G\"&H17))-(INDIRECT(\"G\"&FirstRow&\":G\"&H17-1)),(((INDIRECT(\"H\"&FirstRow+1&\":H\"&H17))+(INDIRECT(\"H\"&FirstRow&\":H\"&H17-1)))/2)))","v":""},"Wf",{"$f":"IF(ISNA(J17),\"\",SUMPRODUCT((INDIRECT(\"I\"&FirstRow+1&\":I\"&J17))-(INDIRECT(\"I\"&FirstRow&\":I\"&J17-1)),(((INDIRECT(\"J\"&FirstRow+1&\":J\"&J17))+(INDIRECT(\"J\"&FirstRow&\":J\"&J17-1)))/2)))","v":""},"Wf",{"$f":"IF(ISNA(L17),\"\",SUMPRODUCT((INDIRECT(\"K\"&FirstRow+1&\":K\"&L17))-(INDIRECT(\"K\"&FirstRow&\":K\"&L17-1)),(((INDIRECT(\"L\"&FirstRow+1&\":L\"&L17))+(INDIRECT(\"L\"&FirstRow&\":L\"&L17-1)))/2)))","v":""},"Wf",{"$f":"IF(ISNA(N17),\"\",SUMPRODUCT((INDIRECT(\"M\"&FirstRow+1&\":M\"&N17))-(INDIRECT(\"M\"&FirstRow&\":M\"&N17-1)),(((INDIRECT(\"N\"&FirstRow+1&\":N\"&N17))+(INDIRECT(\"N\"&FirstRow&\":N\"&N17-1)))/2)))","v":""},"Wf",{"$f":"IF(ISNA(P17),\"\",SUMPRODUCT((INDIRECT(\"O\"&FirstRow+1&\":O\"&P17))-(INDIRECT(\"O\"&FirstRow&\":O\"&P17-1)),(((INDIRECT(\"P\"&FirstRow+1&\":P\"&P17))+(INDIRECT(\"P\"&FirstRow&\":P\"&P17-1)))/2)))","v":""},null,null,null,null,null,null,null,{"$error":"#NAME?"},{"$error":"#NAME?"}]
["Gf",{"$f":"IF(B19=\"\",\"\",(B19/(B25*B26))*1000000)","v":""},"Gf",{"$f":"IF(D19=\"\",\"\",(D19/(D25*D26))*1000000)","v":""},"Gf",{"$f":"IF(F19=\"\",\"\",(F19/(F25*F26))*1000000)","v":""},"Gf",{"$f":"IF(H19=\"\",\"\",(H19/(H25*H26))*1000000)","v":""},"Gf",{"$f":"IF(J19=\"\",\"\",(J19/(J25*J26))*1000000)","v":""},"Gf",{"$f":"IF(L19=\"\",\"\",(L19/(L25*L26))*1000000)","v":""},"Gf",{"$f":"IF(N19=\"\",\"\",(N19/(N25*N26))*1000000)","v":""},"Gf",{"$f":"IF(P19=\"\",\"\",(P19/(P25*P26))*1000000)","v":""},null,null,null,null,null,null,null,{"$error":"#NAME?"},{"$error":"#NAME?"}]
["CTIndex",{"$f":"IF(B20=\"\",\"\",(B26/62)*(B14/B25)*(B20/B18))","v":""},"CTIndex",{"$f":"IF(D20=\"\",\"\",(D26/62)*(D14/D25)*(D20/D18))","v":""},"CTIndex",{"$f":"IF(F20=\"\",\"\",(F26/62)*(F14/F25)*(F20/F18))","v":""},"CTIndex",{"$f":"IF(H20=\"\",\"\",(H26/62)*(H14/H25)*(H20/H18))","v":""},"CTIndex",{"$f":"IF(J20=\"\",\"\",(J26/62)*(J14/J25)*(J20/J18))","v":""},"CTIndex",{"$f":"IF(L20=\"\",\"\",(L26/62)*(L14/L25)*(L20/L18))","v":""},"CTIndex",{"$f":"IF(N20=\"\",\"\",(N26/62)*(N14/N25)*(N20/N18))","v":""},"CTIndex",{"$f":"IF(P20=\"\",\"\",(P26/62)*(P14/P25)*(P20/P18))","v":""},null,null,null,null,null,null,null,{"$error":"#NAME?"},{"$error":"#NAME?"}]
["Sample 1 ID",null,"Sample 2 ID",null,"Sample 3 ID",null,"Sample 4 ID",null,"Sample 5 ID",null,"Sample 6 ID",null,"Sample 7 ID",null,"Sample 8 ID",null,null,null,null,null,null,null,null,{"$error":"#NAME?"},{"$error":"#NAME?"}]
["Temp [C]",null,"Temp [C]",null,"Temp [C]",null,"Temp [C]",null,"Temp [C]",null,"Temp [C]",null,"Temp [C]",null,"Temp [C]",null,null,null,null,null,null,null,null,{"$error":"#NAME?"},{"$error":"#NAME?"}]
["Air Voids",null,"Air Voids",null,"Air Voids",null,"Air Voids",null,"Air Voids",null,"Air Voids",null,"Air Voids",null,"Air Voids",null,null,null,null,null,null,null,null,{"$error":"#NAME?"},{"$error":"#NAME?"}]
["Diameter",null,"Diameter",null,"Diameter",null,"Diameter",null,"Diameter",null,"Diameter",null,"Diameter",null,"Diameter",null,null,null,null,null,null,null,null,{"$error":"#NAME?"},{"$error":"#NAME?"}]
["Thickness",null,"Thickness",null,"Thickness",null,"Thickness",null,"Thickness",null,"Thickness",null,"Thickness",null,"Thickness",null,null,null,null,null,null,null,null,{"$error":"#NAME?"},{"$error":"#NAME?"}]
["Flow/Stability Data",null,null,null,null,null,null,null,null,null,null,null,null,null,null,null,null,null,null,null,null,null,null,{"$error":"#NAME?"},{"$error":"#NAME?"}]
[null,null,null,null,null,null,null,null,null,null,null,null,null,null,null,null,null,null,null,null,null,null,null,{"$error":"#NAME?"},{"$error":"#NAME?"}]
[{"$f":"IF(ISBLANK(A31),\"\",INDIRECT(\"A$\"&MATCH(MAX(B31:B1031),B31:B1031,0)+FirstRow-1))","v":""},{"$f":"IF(ISBLANK(B31),\"\",MAX(B31:B1031))","v":""},{"$f":"IF(ISBLANK(C31),\"\",INDIRECT(\"C$\"&MATCH(MAX(D31:D1031),D31:D1031,0)+FirstRow-1))","v":""},{"$f":"IF(ISBLANK(D31),\"\",MAX(D31:D1031))","v":""},{"$f":"IF(ISBLANK(E31),\"\",INDIRECT(\"E$\"&MATCH(MAX(F31:F1031),F31:F1031,0)+FirstRow-1))","v":""},{"$f":"IF(ISBLANK(F31),\"\",MAX(F31:F1031))","v":""},{"$f":"IF(ISBLANK(G31),\"\",INDIRECT(\"g$\"&MATCH(MAX(H31:H1031),H31:H1031,0)+FirstRow-1))","v":""},{"$f":"IF(ISBLANK(H31),\"\",MAX(H31:H1031))","v":""},{"$f":"IF(ISBLANK(I31),\"\",INDIRECT(\"I$\"&MATCH(MAX(J31:J1031),J31:J1031,0)+FirstRow-1))","v":""},{"$f":"IF(ISBLANK(J31),\"\",MAX(J31:J1031))","v":""},{"$f":"IF(ISBLANK(K31),\"\",INDIRECT(\"K$\"&MATCH(MAX(L31:L1031),L31:L1031,0)+FirstRow-1))","v":""},{"$f":"IF(ISBLANK(L31),\"\",MAX(L31:L1031))","v":""},{"$f":"IF(ISBLANK(M31),\"\",INDIRECT(\"M$\"&MATCH(MAX(N31:N1031),N31:N1031,0)+FirstRow-1))","v":""},{"$f":"IF(ISBLANK(N31),\"\",MAX(N31:N1031))","v":""},{"$f":"IF(ISBLANK(O31),\"\",INDIRECT(\"O$\"&MATCH(MAX(P31:P1031),P31:P1031,0)+FirstRow-1))","v":""},{"$f":"IF(ISBLANK(P31),\"\",MAX(P31:P1031))","v":""},null,null,null,null,null,null,null,{"$error":"#NAME?"},{"$error":"#NAME?"}]
["Flow (mm)","Stability (kN)","Flow","Stability","Flow","Stability","Flow","Stability","Flow","Stability","Flow","Stability","Flow","Stability","Flow","Stability",null,null,null,null,null,null,null,{"$error":"#NAME?"},{"$error":"#NAME?"}]
[null,null,null,null,null,null,null,null,null,null,null,null,null,null,null,null,null,"Max Scale",{"$f":"MAX(B31:B706,D31:D706,F31:F706,H31:H706,J31:J706,L31:L706,N31:N706,P31:P706)","v":0},null,null,null,null,{"$error":"#NAME?"},{"$error":"#NAME?"}]
[null,null,null,null,null,null,null,null,null,null,null,null,null,null,null,null,null,"Port","COM1",null,null,null,null,{"$error":"#NAME?"},{"$error":"#NAME?"}]
[null,null,null,null,null,null,null,null,null,null,null,null,null,null,null,null,null,"Settings","baud=38400 parity=N data=8 stop=1",null,null,null,null,{"$error":"#NAME?"},{"$error":"#NAME?"}]
[null,null,null,null,null,null,null,null,null,null,null,null,null,null,null,null,null,null,null,null,null,null,null,{"$error":"#NAME?"},{"$error":"#NAME?"}]
[null,null,null,null,null,null,null,null,null,null,null,null,null,null,null,null,null,null,null,null,null,null,null,{"$error":"#NAME?"},{"$error":"#NAME?"}]
[null,null,null,null,null,null,null,null,null,null,null,null,null,null,null,null,null,null,null,null,null,null,null,{"$error":"#NAME?"},{"$error":"#NAME?"}]
[null,null,null,null,null,null,null,null,null,null,null,null,null,null,null,null,null,null,null,null,null,null,null,{"$error":"#NAME?"},{"$error":"#NAME?"}]
[null,null,null,null,null,null,null,null,null,null,null,null,null,null,null,null,null,null,null,null,null,null,null,{"$error":"#NAME?"},{"$error":"#NAME?"}]
[null,null,null,null,null,null,null,null,null,null,null,null,null,null,null,null,null,null,null,null,null,null,null,{"$error":"#NAME?"},{"$error":"#NAME?"}]
[null,null,null,null,null,null,null,null,null,null,null,null,null,null,null,null,null,null,null,null,null,null,null,{"$error":"#NAME?"},{"$error":"#NAME?"}]
[null,null,null,null,null,null,null,null,null,null,null,null,null,null,null,null,null,null,null,null,null,null,null,{"$error":"#NAME?"},{"$error":"#NAME?"}]
[null,null,null,null,null,null,null,null,null,null,null,null,null,null,null,null,null,null,null,null,null,null,null,{"$error":"#NAME?"},{"$error":"#NAME?"}]
[null,null,null,null,null,null,null,null,null,null,null,null,null,null,null,null,null,null,null,null,null,null,null,{"$error":"#NAME?"},{"$error":"#NAME?"}]
[null,null,null,null,null,null,null,null,null,null,null,null,null,null,null,null,null,null,null,null,null,null,null,{"$error":"#NAME?"},{"$error":"#NAME?"}]
[null,null,null,null,null,null,null,null,null,null,null,null,null,null,null,null,null,null,null,null,null,null,null,{"$error":"#NAME?"},{"$error":"#NAME?"}]
[null,null,null,null,null,null,null,null,null,null,null,null,null,null,null,null,null,null,null,null,null,null,null,{"$error":"#NAME?"},{"$error":"#NAME?"}]
[null,null,null,null,null,null,null,null,null,null,null,null,null,null,null,null,null,null,null,null,null,null,null,{"$error":"#NAME?"},{"$error":"#NAME?"}]
[null,null,null,null,null,null,null,null,null,null,null,null,null,null,null,null,null,null,null,null,null,null,null,{"$error":"#NAME?"},{"$error":"#NAME?"}]
[null,null,null,null,null,null,null,null,null,null,null,null,null,null,null,null,null,null,null,null,null,null,null,{"$error":"#NAME?"},{"$error":"#NAME?"}]
[null,null,null,null,null,null,null,null,null,null,null,null,null,null,null,null,null,null,null,null,null,null,null,{"$error":"#NAME?"},{"$error":"#NAME?"}]
[null,null,null,null,null,null,null,null,null,null,null,null,null,null,null,null,null,null,null,null,null,null,null,{"$error":"#NAME?"},{"$error":"#NAME?"}]
[null,null,null,null,null,null,null,null,null,null,null,null,null,null,null,null,null,null,null,null,null,null,null,{"$error":"#NAME?"},{"$error":"#NAME?"}]
[null,null,null,null,null,null,null,null,null,null,null,null,null,null,null,null,null,null,null,null,null,null,null,{"$error":"#NAME?"},{"$error":"#NAME?"}]
[null,null,null,null,null,null,null,null,null,null,null,null,null,null,null,null,null,null,null,null,null,null,null,{"$error":"#NAME?"},{"$error":"#NAME?"}]
[null,null,null,null,null,null,null,null,null,null,null,null,null,null,null,null,null,null,null,null,null,null,null,{"$error":"#NAME?"},{"$error":"#NAME?"}]
[null,null,null,null,null,null,null,null,null,null,null,null,null,null,null,null,null,null,null,null,null,null,null,{"$error":"#NAME?"},{"$error":"#NAME?"}]
[null,null,null,null,null,null,null,null,null,null,null,null,null,null,null,null,null,null,null,null,null,null,null,{"$error":"#NAME?"},{"$error":"#NAME?"}]
[null,null,null,null,null,null,null,null,null,null,null,null,null,null,null,null,null,null,null,null,null,null,null,{"$error":"#NAME?"},{"$error":"#NAME?"}]
[null,null,null,null,null,null,null,null,null,null,null,null,null,null,null,null,null,null,null,null,null,null,null,{"$error":"#NAME?"},{"$error":"#NAME?"}]
[null,null,null,null,null,null,null,null,null,null,null,null,null,null,null,null,null,null,null,null,null,null,null,{"$error":"#NAME?"},{"$error":"#NAME?"}]
[null,null,null,null,null,null,null,null,null,null,null,null,null,null,null,null,null,null,null,null,null,null,null,{"$error":"#NAME?"},{"$error":"#NAME?"}]
[null,null,null,null,null,null,null,null,null,null,null,null,null,null,null,null,null,null,null,null,null,null,null,{"$error":"#NAME?"},{"$error":"#NAME?"}]
[null,null,null,null,null,null,null,null,null,null,null,null,null,null,null,null,null,null,null,null,null,null,null,{"$error":"#NAME?"},{"$error":"#NAME?"}]
[null,null,null,null,null,null,null,null,null,null,null,null,null,null,null,null,null,null,null,null,null,null,null,{"$error":"#NAME?"},{"$error":"#NAME?"}]
[null,null,null,null,null,null,null,null,null,null,null,null,null,null,null,null,null,null,null,null,null,null,null,{"$error":"#NAME?"},{"$error":"#NAME?"}]
[null,null,null,null,null,null,null,null,null,null,null,null,null,null,null,null,null,null,null,null,null,null,null,{"$error":"#NAME?"},{"$error":"#NAME?"}]
[null,null,null,null,null,null,null,null,null,null,null,null,null,null,null,null,null,null,null,null,null,null,null,{"$error":"#NAME?"},{"$error":"#NAME?"}]
[null,null,null,null,null,null,null,null,null,null,null,null,null,null,null,null,null,null,null,null,null,null,null,{"$error":"#NAME?"},{"$error":"#NAME?"}]
[null,null,null,null,null,null,null,null,null,null,null,null,null,null,null,null,null,null,null,null,null,null,null,{"$error":"#NAME?"},{"$error":"#NAME?"}]
[null,null,null,null,null,null,null,null,null,null,null,null,null,null,null,null,null,null,null,null,null,null,null,{"$error":"#NAME?"},{"$error":"#NAME?"}]
[null,null,null,null,null,null,null,null,null,null,null,null,null,null,null,null,null,null,null,null,null,null,null,{"$error":"#NAME?"},{"$error":"#NAME?"}]
[null,null,null,null,null,null,null,null,null,null,null,null,null,null,null,null,null,null,null,null,null,null,null,{"$error":"#NAME?"},{"$error":"#NAME?"}]
[null,null,null,null,null,null,null,null,null,null,null,null,null,null,null,null,null,null,null,null,null,null,null,{"$error":"#NAME?"},{"$error":"#NAME?"}]
[null,null,null,null,null,null,null,null,null,null,null,null,null,null,null,null,null,null,null,null,null,null,null,{"$error":"#NAME?"},{"$error":"#NAME?"}]
[null,null,null,null,null,null,null,null,null,null,null,null,null,null,null,null,null,null,null,null,null,null,null,{"$error":"#NAME?"},{"$error":"#NAME?"}]
[null,null,null,null,null,null,null,null,null,null,null,null,null,null,null,null,null,null,null,null,null,null,null,{"$error":"#NAME?"},{"$error":"#NAME?"}]
[null,null,null,null,null,null,null,null,null,null,null,null,null,null,null,null,null,null,null,null,null,null,null,{"$error":"#NAME?"},{"$error":"#NAME?"}]
[null,null,null,null,null,null,null,null,null,null,null,null,null,null,null,null,null,null,null,null,null,null,null,{"$error":"#NAME?"},{"$error":"#NAME?"}]
[null,null,null,null,null,null,null,null,null,null,null,null,null,null,null,null,null,null,null,null,null,null,null,{"$error":"#NAME?"},{"$error":"#NAME?"}]
[null,null,null,null,null,null,null,null,null,null,null,null,null,null,null,null,null,null,null,null,null,null,null,{"$error":"#NAME?"},{"$error":"#NAME?"}]
[null,null,null,null,null,null,null,null,null,null,null,null,null,null,null,null,null,null,null,null,null,null,null,{"$error":"#NAME?"},{"$error":"#NAME?"}]
[null,null,null,null,null,null,null,null,null,null,null,null,null,null,null,null,null,null,null,null,null,null,null,{"$error":"#NAME?"},{"$error":"#NAME?"}]
[null,null,null,null,null,null,null,null,null,null,null,null,null,null,null,null,null,null,null,null,null,null,null,{"$error":"#NAME?"},{"$error":"#NAME?"}]
[null,null,null,null,null,null,null,null,null,null,null,null,null,null,null,null,null,null,null,null,null,null,null,{"$error":"#NAME?"},{"$error":"#NAME?"}]
[null,null,null,null,null,null,null,null,null,null,null,null,null,null,null,null,null,null,null,null,null,null,null,{"$error":"#NAME?"},{"$error":"#NAME?"}]
[null,null,null,null,null,null,null,null,null,null,null,null,null,null,null,null,null,null,null,null,null,null,null,{"$error":"#NAME?"},{"$error":"#NAME?"}]
[null,null,null,null,null,null,null,null,null,null,null,null,null,null,null,null,null,null,null,null,null,null,null,{"$error":"#NAME?"},{"$error":"#NAME?"}]
[null,null,null,null,null,null,null,null,null,null,null,null,null,null,null,null,null,null,null,null,null,null,null,{"$error":"#NAME?"},{"$error":"#NAME?"}]
[null,null,null,null,null,null,null,null,null,null,null,null,null,null,null,null,null,null,null,null,null,null,null,{"$error":"#NAME?"},{"$error":"#NAME?"}]
[null,null,null,null,null,null,null,null,null,null,null,null,null,null,null,null,null,null,null,null,null,null,null,{"$error":"#NAME?"},{"$error":"#NAME?"}]
[null,null,null,null,null,null,null,null,null,null,null,null,null,null,null,null,null,null,null,null,null,null,null,{"$error":"#NAME?"},{"$error":"#NAME?"}]
[null,null,null,null,null,null,null,null,null,null,null,null,null,null,null,null,null,null,null,null,null,null,null,{"$error":"#NAME?"},{"$error":"#NAME?"}]
[null,null,null,null,null,null,null,null,null,null,null,null,null,null,null,null,null,null,null,null,null,null,null,{"$error":"#NAME?"},{"$error":"#NAME?"}]
[null,null,null,null,null,null,null,null,null,null,null,null,null,null,null,null,null,null,null,null,null,null,null,{"$error":"#NAME?"},{"$error":"#NAME?"}]
[null,null,null,null,null,null,null,null,null,null,null,null,null,null,null,null,null,null,null,null,null,null,null,{"$error":"#NAME?"},{"$error":"#NAME?"}]
[null,null,null,null,null,null,null,null,null,null,null,null,null,null,null,null,null,null,null,null,null,null,null,{"$error":"#NAME?"},{"$error":"#NAME?"}]
[null,null,null,null,null,null,null,null,null,null,null,null,null,null,null,null,null,null,null,null,null,null,null,{"$error":"#NAME?"},{"$error":"#NAME?"}]
[null,null,null,null,null,null,null,null,null,null,null,null,null,null,null,null,null,null,null,null,null,null,null,{"$error":"#NAME?"},{"$error":"#NAME?"}]
[null,null,null,null,null,null,null,null,null,null,null,null,null,null,null,null,null,null,null,null,null,null,null,{"$error":"#NAME?"},{"$error":"#NAME?"}]
[null,null,null,null,null,null,null,null,null,null,null,null,null,null,null,null,null,null,null,null,null,null,null,{"$error":"#NAME?"},{"$error":"#NAME?"}]
[null,null,null,null,null,null,null,null,null,null,null,null,null,null,null,null,null,null,null,null,null,null,null,{"$error":"#NAME?"},{"$error":"#NAME?"}]
[null,null,null,null,null,null,null,null,null,null,null,null,null,null,null,null,null,null,null,null,null,null,null,{"$error":"#NAME?"},{"$error":"#NAME?"}]
[null,null,null,null,null,null,null,null,null,null,null,null,null,null,null,null,null,null,null,null,null,null,null,{"$error":"#NAME?"},{"$error":"#NAME?"}]
[null,null,null,null,null,null,null,null,null,null,null,null,null,null,null,null,null,null,null,null,null,null,null,{"$error":"#NAME?"},{"$error":"#NAME?"}]
[null,null,null,null,null,null,null,null,null,null,null,null,null,null,null,null,null,null,null,null,null,null,null,{"$error":"#NAME?"},{"$error":"#NAME?"}]
[null,null,null,null,null,null,null,null,null,null,null,null,null,null,null,null,null,null,null,null,null,null,null,{"$error":"#NAME?"},{"$error":"#NAME?"}]
[null,null,null,null,null,null,null,null,null,null,null,null,null,null,null,null,null,null,null,null,null,null,null,{"$error":"#NAME?"},{"$error":"#NAME?"}]
[null,null,null,null,null,null,null,null,null,null,null,null,null,null,null,null,null,null,null,null,null,null,null,{"$error":"#NAME?"},{"$error":"#NAME?"}]
[null,null,null,null,null,null,null,null,null,null,null,null,null,null,null,null,null,null,null,null,null,null,null,{"$error":"#NAME?"},{"$error":"#NAME?"}]
[null,null,null,null,null,null,null,null,null,null,null,null,null,null,null,null,null,null,null,null,null,null,null,{"$error":"#NAME?"},{"$error":"#NAME?"}]
[null,null,null,null,null,null,null,null,null,null,null,null,null,null,null,null,null,null,null,null,null,null,null,{"$error":"#NAME?"},{"$error":"#NAME?"}]
[null,null,null,null,null,null,null,null,null,null,null,null,null,null,null,null,null,null,null,null,null,null,null,{"$error":"#NAME?"},{"$error":"#NAME?"}]
[null,null,null,null,null,null,null,null,null,null,null,null,null,null,null,null,null,null,null,null,null,null,null,{"$error":"#NAME?"},{"$error":"#NAME?"}]
[null,null,null,null,null,null,null,null,null,null,null,null,null,null,null,null,null,null,null,null,null,null,null,{"$error":"#NAME?"},{"$error":"#NAME?"}]
[null,null,null,null,null,null,null,null,null,null,null,null,null,null,null,null,null,null,null,null,null,null,null,{"$error":"#NAME?"},{"$error":"#NAME?"}]
[null,null,null,null,null,null,null,null,null,null,null,null,null,null,null,null,null,null,null,null,null,null,null,{"$error":"#NAME?"},{"$error":"#NAME?"}]
[null,null,null,null,null,null,null,null,null,null,null,null,null,null,null,null,null,null,null,null,null,null,null,{"$error":"#NAME?"},{"$error":"#NAME?"}]
[null,null,null,null,null,null,null,null,null,null,null,null,null,null,null,null,null,null,null,null,null,null,null,{"$error":"#NAME?"},{"$error":"#NAME?"}]
[null,null,null,null,null,null,null,null,null,null,null,null,null,null,null,null,null,null,null,null,null,null,null,{"$error":"#NAME?"},{"$error":"#NAME?"}]
[null,null,null,null,null,null,null,null,null,null,null,null,null,null,null,null,null,null,null,null,null,null,null,{"$error":"#NAME?"},{"$error":"#NAME?"}]
[null,null,null,null,null,null,null,null,null,null,null,null,null,null,null,null,null,null,null,null,null,null,null,{"$error":"#NAME?"},{"$error":"#NAME?"}]
[null,null,null,null,null,null,null,null,null,null,null,null,null,null,null,null,null,null,null,null,null,null,null,{"$error":"#NAME?"},{"$error":"#NAME?"}]
[null,null,null,null,null,null,null,null,null,null,null,null,null,null,null,null,null,null,null,null,null,null,null,{"$error":"#NAME?"},{"$error":"#NAME?"}]
[null,null,null,null,null,null,null,null,null,null,null,null,null,null,null,null,null,null,null,null,null,null,null,{"$error":"#NAME?"},{"$error":"#NAME?"}]
[null,null,null,null,null,null,null,null,null,null,null,null,null,null,null,null,null,null,null,null,null,null,null,{"$error":"#NAME?"},{"$error":"#NAME?"}]
[null,null,null,null,null,null,null,null,null,null,null,null,null,null,null,null,null,null,null,null,null,null,null,{"$error":"#NAME?"},{"$error":"#NAME?"}]
[null,null,null,null,null,null,null,null,null,null,null,null,null,null,null,null,null,null,null,null,null,null,null,{"$error":"#NAME?"},{"$error":"#NAME?"}]
[null,null,null,null,null,null,null,null,null,null,null,null,null,null,null,null,null,null,null,null,null,null,null,{"$error":"#NAME?"},{"$error":"#NAME?"}]
[null,null,null,null,null,null,null,null,null,null,null,null,null,null,null,null,null,null,null,null,null,null,null,{"$error":"#NAME?"},{"$error":"#NAME?"}]
[null,null,null,null,null,null,null,null,null,null,null,null,null,null,null,null,null,null,null,null,null,null,null,{"$error":"#NAME?"},{"$error":"#NAME?"}]
[null,null,null,null,null,null,null,null,null,null,null,null,null,null,null,null,null,null,null,null,null,null,null,{"$error":"#NAME?"},{"$error":"#NAME?"}]
[null,null,null,null,null,null,null,null,null,null,null,null,null,null,null,null,null,null,null,null,null,null,null,{"$error":"#NAME?"},{"$error":"#NAME?"}]
[null,null,null,null,null,null,null,null,null,null,null,null,null,null,null,null,null,null,null,null,null,null,null,{"$error":"#NAME?"},{"$error":"#NAME?"}]
[null,null,null,null,null,null,null,null,null,null,null,null,null,null,null,null,null,null,null,null,null,null,null,{"$error":"#NAME?"},{"$error":"#NAME?"}]
[null,null,null,null,null,null,null,null,null,null,null,null,null,null,null,null,null,null,null,null,null,null,null,{"$error":"#NAME?"},{"$error":"#NAME?"}]
[null,null,null,null,null,null,null,null,null,null,null,null,null,null,null,null,null,null,null,null,null,null,null,{"$error":"#NAME?"},{"$error":"#NAME?"}]
[null,null,null,null,null,null,null,null,null,null,null,null,null,null,null,null,null,null,null,null,null,null,null,{"$error":"#NAME?"},{"$error":"#NAME?"}]
[null,null,null,null,null,null,null,null,null,null,null,null,null,null,null,null,null,null,null,null,null,null,null,{"$error":"#NAME?"},{"$error":"#NAME?"}]
[null,null,null,null,null,null,null,null,null,null,null,null,null,null,null,null,null,null,null,null,null,null,null,{"$error":"#NAME?"},{"$error":"#NAME?"}]
[null,null,null,null,null,null,null,null,null,null,null,null,null,null,null,null,null,null,null,null,null,null,null,{"$error":"#NAME?"},{"$error":"#NAME?"}]
[null,null,null,null,null,null,null,null,null,null,null,null,null,null,null,null,null,null,null,null,null,null,null,{"$error":"#NAME?"},{"$error":"#NAME?"}]
[null,null,null,null,null,null,null,null,null,null,null,null,null,null,null,null,null,null,null,null,null,null,null,{"$error":"#NAME?"},{"$error":"#NAME?"}]
[null,null,null,null,null,null,null,null,null,null,null,null,null,null,null,null,null,null,null,null,null,null,null,{"$error":"#NAME?"},{"$error":"#NAME?"}]
[null,null,null,null,null,null,null,null,null,null,null,null,null,null,null,null,null,null,null,null,null,null,null,{"$error":"#NAME?"},{"$error":"#NAME?"}]
[null,null,null,null,null,null,null,null,null,null,null,null,null,null,null,null,null,null,null,null,null,null,null,{"$error":"#NAME?"},{"$error":"#NAME?"}]
[null,null,null,null,null,null,null,null,null,null,null,null,null,null,null,null,null,null,null,null,null,null,null,{"$error":"#NAME?"},{"$error":"#NAME?"}]
[null,null,null,null,null,null,null,null,null,null,null,null,null,null,null,null,null,null,null,null,null,null,null,{"$error":"#NAME?"},{"$error":"#NAME?"}]
[null,null,null,null,null,null,null,null,null,null,null,null,null,null,null,null,null,null,null,null,null,null,null,{"$error":"#NAME?"},{"$error":"#NAME?"}]
[null,null,null,null,null,null,null,null,null,null,null,null,null,null,null,null,null,null,null,null,null,null,null,{"$error":"#NAME?"},{"$error":"#NAME?"}]
[null,null,null,null,null,null,null,null,null,null,null,null,null,null,null,null,null,null,null,null,null,null,null,{"$error":"#NAME?"},{"$error":"#NAME?"}]
[null,null,null,null,null,null,null,null,null,null,null,null,null,null,null,null,null,null,null,null,null,null,null,{"$error":"#NAME?"},{"$error":"#NAME?"}]
[null,null,null,null,null,null,null,null,null,null,null,null,null,null,null,null,null,null,null,null,null,null,null,{"$error":"#NAME?"},{"$error":"#NAME?"}]
[null,null,null,null,null,null,null,null,null,null,null,null,null,null,null,null,null,null,null,null,null,null,null,{"$error":"#NAME?"},{"$error":"#NAME?"}]
[null,null,null,null,null,null,null,null,null,null,null,null,null,null,null,null,null,null,null,null,null,null,null,{"$error":"#NAME?"},{"$error":"#NAME?"}]
[null,null,null,null,null,null,null,null,null,null,null,null,null,null,null,null,null,null,null,null,null,null,null,{"$error":"#NAME?"},{"$error":"#NAME?"}]
[null,null,null,null,null,null,null,null,null,null,null,null,null,null,null,null,null,null,null,null,null,null,null,{"$error":"#NAME?"},{"$error":"#NAME?"}]
[null,null,null,null,null,null,null,null,null,null,null,null,null,null,null,null,null,null,null,null,null,null,null,{"$error":"#NAME?"},{"$error":"#NAME?"}]
[null,null,null,null,null,null,null,null,null,null,null,null,null,null,null,null,null,null,null,null,null,null,null,{"$error":"#NAME?"},{"$error":"#NAME?"}]
[null,null,null,null,null,null,null,null,null,null,null,null,null,null,null,null,null,null,null,null,null,null,null,{"$error":"#NAME?"},{"$error":"#NAME?"}]
[null,null,null,null,null,null,null,null,null,null,null,null,null,null,null,null,null,null,null,null,null,null,null,{"$error":"#NAME?"},{"$error":"#NAME?"}]
[null,null,null,null,null,null,null,null,null,null,null,null,null,null,null,null,null,null,null,null,null,null,null,{"$error":"#NAME?"},{"$error":"#NAME?"}]
[null,null,null,null,null,null,null,null,null,null,null,null,null,null,null,null,null,null,null,null,null,null,null,{"$error":"#NAME?"},{"$error":"#NAME?"}]
[null,null,null,null,null,null,null,null,null,null,null,null,null,null,null,null,null,null,null,null,null,null,null,{"$error":"#NAME?"},{"$error":"#NAME?"}]
[null,null,null,null,null,null,null,null,null,null,null,null,null,null,null,null,null,null,null,null,null,null,null,{"$error":"#NAME?"},{"$error":"#NAME?"}]
[null,null,null,null,null,null,null,null,null,null,null,null,null,null,null,null,null,null,null,null,null,null,null,{"$error":"#NAME?"},{"$error":"#NAME?"}]
[null,null,null,null,null,null,null,null,null,null,null,null,null,null,null,null,null,null,null,null,null,null,null,{"$error":"#NAME?"},{"$error":"#NAME?"}]
[null,null,null,null,null,null,null,null,null,null,null,null,null,null,null,null,null,null,null,null,null,null,null,{"$error":"#NAME?"},{"$error":"#NAME?"}]
[null,null,null,null,null,null,null,null,null,null,null,null,null,null,null,null,null,null,null,null,null,null,null,{"$error":"#NAME?"},{"$error":"#NAME?"}]
[null,null,null,null,null,null,null,null,null,null,null,null,null,null,null,null,null,null,null,null,null,null,null,{"$error":"#NAME?"},{"$error":"#NAME?"}]
[null,null,null,null,null,null,null,null,null,null,null,null,null,null,null,null,null,null,null,null,null,null,null,{"$error":"#NAME?"},{"$error":"#NAME?"}]
[null,null,null,null,null,null,null,null,null,null,null,null,null,null,null,null,null,null,null,null,null,null,null,{"$error":"#NAME?"},{"$error":"#NAME?"}]
[null,null,null,null,null,null,null,null,null,null,null,null,null,null,null,null,null,null,null,null,null,null,null,{"$error":"#NAME?"},{"$error":"#NAME?"}]
[null,null,null,null,null,null,null,null,null,null,null,null,null,null,null,null,null,null,null,null,null,null,null,{"$error":"#NAME?"},{"$error":"#NAME?"}]
[null,null,null,null,null,null,null,null,null,null,null,null,null,null,null,null,null,null,null,null,null,null,null,{"$error":"#NAME?"},{"$error":"#NAME?"}]
[null,null,null,null,null,null,null,null,null,null,null,null,null,null,null,null,null,null,null,null,null,null,null,{"$error":"#NAME?"},{"$error":"#NAME?"}]
[null,null,null,null,null,null,null,null,null,null,null,null,null,null,null,null,null,null,null,null,null,null,null,{"$error":"#NAME?"},{"$error":"#NAME?"}]
[null,null,null,null,null,null,null,null,null,null,null,null,null,null,null,null,null,null,null,null,null,null,null,{"$error":"#NAME?"},{"$error":"#NAME?"}]
[null,null,null,null,null,null,null,null,null,null,null,null,null,null,null,null,null,null,null,null,null,null,null,{"$error":"#NAME?"},{"$error":"#NAME?"}]
[null,null,null,null,null,null,null,null,null,null,null,null,null,null,null,null,null,null,null,null,null,null,null,{"$error":"#NAME?"},{"$error":"#NAME?"}]
[null,null,null,null,null,null,null,null,null,null,null,null,null,null,null,null,null,null,null,null,null,null,null,{"$error":"#NAME?"},{"$error":"#NAME?"}]
[null,null,null,null,null,null,null,null,null,null,null,null,null,null,null,null,null,null,null,null,null,null,null,{"$error":"#NAME?"},{"$error":"#NAME?"}]
[null,null,null,null,null,null,null,null,null,null,null,null,null,null,null,null,null,null,null,null,null,null,null,{"$error":"#NAME?"},{"$error":"#NAME?"}]
[null,null,null,null,null,null,null,null,null,null,null,null,null,null,null,null,null,null,null,null,null,null,null,{"$error":"#NAME?"},{"$error":"#NAME?"}]
[null,null,null,null,null,null,null,null,null,null,null,null,null,null,null,null,null,null,null,null,null,null,null,{"$error":"#NAME?"},{"$error":"#NAME?"}]
[null,null,null,null,null,null,null,null,null,null,null,null,null,null,null,null,null,null,null,null,null,null,null,{"$error":"#NAME?"},{"$error":"#NAME?"}]
[null,null,null,null,null,null,null,null,null,null,null,null,null,null,null,null,null,null,null,null,null,null,null,{"$error":"#NAME?"},{"$error":"#NAME?"}]
[null,null,null,null,null,null,null,null,null,null,null,null,null,null,null,null,null,null,null,null,null,null,null,{"$error":"#NAME?"},{"$error":"#NAME?"}]
[null,null,null,null,null,null,null,null,null,null,null,null,null,null,null,null,null,null,null,null,null,null,null,{"$error":"#NAME?"},{"$error":"#NAME?"}]
[null,null,null,null,null,null,null,null,null,null,null,null,null,null,null,null,null,null,null,null,null,null,null,{"$error":"#NAME?"},{"$error":"#NAME?"}]
[null,null,null,null,null,null,null,null,null,null,null,null,null,null,null,null,null,null,null,null,null,null,null,{"$error":"#NAME?"},{"$error":"#NAME?"}]
[null,null,null,null,null,null,null,null,null,null,null,null,null,null,null,null,null,null,null,null,null,null,null,{"$error":"#NAME?"},{"$error":"#NAME?"}]
[null,null,null,null,null,null,null,null,null,null,null,null,null,null,null,null,null,null,null,null,null,null,null,{"$error":"#NAME?"},{"$error":"#NAME?"}]
[null,null,null,null,null,null,null,null,null,null,null,null,null,null,null,null,null,null,null,null,null,null,null,{"$error":"#NAME?"},{"$error":"#NAME?"}]
[null,null,null,null,null,null,null,null,null,null,null,null,null,null,null,null,null,null,null,null,null,null,null,{"$error":"#NAME?"},{"$error":"#NAME?"}]
[null,null,null,null,null,null,null,null,null,null,null,null,null,null,null,null,null,null,null,null,null,null,null,{"$error":"#NAME?"},{"$error":"#NAME?"}]
[null,null,null,null,null,null,null,null,null,null,null,null,null,null,null,null,null,null,null,null,null,null,null,{"$error":"#NAME?"},{"$error":"#NAME?"}]
[null,null,null,null,null,null,null,null,null,null,null,null,null,null,null,null,null,null,null,null,null,null,null,{"$error":"#NAME?"},{"$error":"#NAME?"}]
[null,null,null,null,null,null,null,null,null,null,null,null,null,null,null,null,null,null,null,null,null,null,null,{"$error":"#NAME?"},{"$error":"#NAME?"}]
[null,null,null,null,null,null,null,null,null,null,null,null,null,null,null,null,null,null,null,null,null,null,null,{"$error":"#NAME?"},{"$error":"#NAME?"}]
[null,null,null,null,null,null,null,null,null,null,null,null,null,null,null,null,null,null,null,null,null,null,null,{"$error":"#NAME?"},{"$error":"#NAME?"}]
[null,null,null,null,null,null,null,null,null,null,null,null,null,null,null,null,null,null,null,null,null,null,null,{"$error":"#NAME?"},{"$error":"#NAME?"}]
[null,null,null,null,null,null,null,null,null,null,null,null,null,null,null,null,null,null,null,null,null,null,null,{"$error":"#NAME?"},{"$error":"#NAME?"}]
[null,null,null,null,null,null,null,null,null,null,null,null,null,null,null,null,null,null,null,null,null,null,null,{"$error":"#NAME?"},{"$error":"#NAME?"}]
[null,null,null,null,null,null,null,null,null,null,null,null,null,null,null,null,null,null,null,null,null,null,null,{"$error":"#NAME?"},{"$error":"#NAME?"}]
[null,null,null,null,null,null,null,null,null,null,null,null,null,null,null,null,null,null,null,null,null,null,null,{"$error":"#NAME?"},{"$error":"#NAME?"}]
[null,null,null,null,null,null,null,null,null,null,null,null,null,null,null,null,null,null,null,null,null,null,null,{"$error":"#NAME?"},{"$error":"#NAME?"}]
[null,null,null,null,null,null,null,null,null,null,null,null,null,null,null,null,null,null,null,null,null,null,null,{"$error":"#NAME?"},{"$error":"#NAME?"}]
[null,null,null,null,null,null,null,null,null,null,null,null,null,null,null,null,null,null,null,null,null,null,null,{"$error":"#NAME?"},{"$error":"#NAME?"}]
[null,null,null,null,null,null,null,null,null,null,null,null,null,null,null,null,null,null,null,null,null,null,null,{"$error":"#NAME?"},{"$error":"#NAME?"}]
[null,null,null,null,null,null,null,null,null,null,null,null,null,null,null,null,null,null,null,null,null,null,null,{"$error":"#NAME?"},{"$error":"#NAME?"}]
[null,null,null,null,null,null,null,null,null,null,null,null,null,null,null,null,null,null,null,null,null,null,null,{"$error":"#NAME?"},{"$error":"#NAME?"}]
[null,null,null,null,null,null,null,null,null,null,null,null,null,null,null,null,null,null,null,null,null,null,null,{"$error":"#NAME?"},{"$error":"#NAME?"}]
[null,null,null,null,null,null,null,null,null,null,null,null,null,null,null,null,null,null,null,null,null,null,null,{"$error":"#NAME?"},{"$error":"#NAME?"}]
[null,null,null,null,null,null,null,null,null,null,null,null,null,null,null,null,null,null,null,null,null,null,null,{"$error":"#NAME?"},{"$error":"#NAME?"}]
[null,null,null,null,null,null,null,null,null,null,null,null,null,null,null,null,null,null,null,null,null,null,null,{"$error":"#NAME?"},{"$error":"#NAME?"}]
[null,null,null,null,null,null,null,null,null,null,null,null,null,null,null,null,null,null,null,null,null,null,null,{"$error":"#NAME?"},{"$error":"#NAME?"}]
[null,null,null,null,null,null,null,null,null,null,null,null,null,null,null,null,null,null,null,null,null,null,null,{"$error":"#NAME?"},{"$error":"#NAME?"}]
[null,null,null,null,null,null,null,null,null,null,null,null,null,null,null,null,null,null,null,null,null,null,null,{"$error":"#NAME?"},{"$error":"#NAME?"}]
[null,null,null,null,null,null,null,null,null,null,null,null,null,null,null,null,null,null,null,null,null,null,null,{"$error":"#NAME?"},{"$error":"#NAME?"}]
[null,null,null,null,null,null,null,null,null,null,null,null,null,null,null,null,null,null,null,null,null,null,null,{"$error":"#NAME?"},{"$error":"#NAME?"}]
[null,null,null,null,null,null,null,null,null,null,null,null,null,null,null,null,null,null,null,null,null,null,null,{"$error":"#NAME?"},{"$error":"#NAME?"}]
[null,null,null,null,null,null,null,null,null,null,null,null,null,null,null,null,null,null,null,null,null,null,null,{"$error":"#NAME?"},{"$error":"#NAME?"}]
[null,null,null,null,null,null,null,null,null,null,null,null,null,null,null,null,null,null,null,null,null,null,null,{"$error":"#NAME?"},{"$error":"#NAME?"}]
[null,null,null,null,null,null,null,null,null,null,null,null,null,null,null,null,null,null,null,null,null,null,null,{"$error":"#NAME?"},{"$error":"#NAME?"}]
[null,null,null,null,null,null,null,null,null,null,null,null,null,null,null,null,null,null,null,null,null,null,null,{"$error":"#NAME?"},{"$error":"#NAME?"}]
[null,null,null,null,null,null,null,null,null,null,null,null,null,null,null,null,null,null,null,null,null,null,null,{"$error":"#NAME?"},{"$error":"#NAME?"}]
[null,null,null,null,null,null,null,null,null,null,null,null,null,null,null,null,null,null,null,null,null,null,null,{"$error":"#NAME?"},{"$error":"#NAME?"}]
[null,null,null,null,null,null,null,null,null,null,null,null,null,null,null,null,null,null,null,null,null,null,null,{"$error":"#NAME?"},{"$error":"#NAME?"}]
[null,null,null,null,null,null,null,null,null,null,null,null,null,null,null,null,null,null,null,null,null,null,null,{"$error":"#NAME?"},{"$error":"#NAME?"}]
[null,null,null,null,null,null,null,null,null,null,null,null,null,null,null,null,null,null,null,null,null,null,null,{"$error":"#NAME?"},{"$error":"#NAME?"}]
[null,null,null,null,null,null,null,null,null,null,null,null,null,null,null,null,null,null,null,null,null,null,null,{"$error":"#NAME?"},{"$error":"#NAME?"}]
[null,null,null,null,null,null,null,null,null,null,null,null,null,null,null,null,null,null,null,null,null,null,null,{"$error":"#NAME?"},{"$error":"#NAME?"}]
[null,null,null,null,null,null,null,null,null,null,null,null,null,null,null,null,null,null,null,null,null,null,null,{"$error":"#NAME?"},{"$error":"#NAME?"}]
[null,null,null,null,null,null,null,null,null,null,null,null,null,null,null,null,null,null,null,null,null,null,null,{"$error":"#NAME?"},{"$error":"#NAME?"}]
[null,null,null,null,null,null,null,null,null,null,null,null,null,null,null,null,null,null,null,null,null,null,null,{"$error":"#NAME?"},{"$error":"#NAME?"}]
[null,null,null,null,null,null,null,null,null,null,null,null,null,null,null,null,null,null,null,null,null,null,null,{"$error":"#NAME?"},{"$error":"#NAME?"}]
[null,null,null,null,null,null,null,null,null,null,null,null,null,null,null,null,null,null,null,null,null,null,null,{"$error":"#NAME?"},{"$error":"#NAME?"}]
[null,null,null,null,null,null,null,null,null,null,null,null,null,null,null,null,null,null,null,null,null,null,null,{"$error":"#NAME?"},{"$error":"#NAME?"}]
[null,null,null,null,null,null,null,null,null,null,null,null,null,null,null,null,null,null,null,null,null,null,null,{"$error":"#NAME?"},{"$error":"#NAME?"}]
[null,null,null,null,null,null,null,null,null,null,null,null,null,null,null,null,null,null,null,null,null,null,null,{"$error":"#NAME?"},{"$error":"#NAME?"}]
[null,null,null,null,null,null,null,null,null,null,null,null,null,null,null,null,null,null,null,null,null,null,null,{"$error":"#NAME?"},{"$error":"#NAME?"}]
[null,null,null,null,null,null,null,null,null,null,null,null,null,null,null,null,null,null,null,null,null,null,null,{"$error":"#NAME?"},{"$error":"#NAME?"}]
[null,null,null,null,null,null,null,null,null,null,null,null,null,null,null,null,null,null,null,null,null,null,null,{"$error":"#NAME?"},{"$error":"#NAME?"}]
[null,null,null,null,null,null,null,null,null,null,null,null,null,null,null,null,null,null,null,null,null,null,null,{"$error":"#NAME?"},{"$error":"#NAME?"}]
[null,null,null,null,null,null,null,null,null,null,null,null,null,null,null,null,null,null,null,null,null,null,null,{"$error":"#NAME?"},{"$error":"#NAME?"}]
[null,null,null,null,null,null,null,null,null,null,null,null,null,null,null,null,null,null,null,null,null,null,null,{"$error":"#NAME?"},{"$error":"#NAME?"}]
[null,null,null,null,null,null,null,null,null,null,null,null,null,null,null,null,null,null,null,null,null,null,null,{"$error":"#NAME?"},{"$error":"#NAME?"}]
[null,null,null,null,null,null,null,null,null,null,null,null,null,null,null,null,null,null,null,null,null,null,null,{"$error":"#NAME?"},{"$error":"#NAME?"}]
[null,null,null,null,null,null,null,null,null,null,null,null,null,null,null,null,null,null,null,null,null,null,null,{"$error":"#NAME?"},{"$error":"#NAME?"}]
[null,null,null,null,null,null,null,null,null,null,null,null,null,null,null,null,null,null,null,null,null,null,null,{"$error":"#NAME?"},{"$error":"#NAME?"}]
[null,null,null,null,null,null,null,null,null,null,null,null,null,null,null,null,null,null,null,null,null,null,null,{"$error":"#NAME?"},{"$error":"#NAME?"}]
[null,null,null,null,null,null,null,null,null,null,null,null,null,null,null,null,null,null,null,null,null,null,null,{"$error":"#NAME?"},{"$error":"#NAME?"}]
[null,null,null,null,null,null,null,null,null,null,null,null,null,null,null,null,null,null,null,null,null,null,null,{"$error":"#NAME?"},{"$error":"#NAME?"}]
[null,null,null,null,null,null,null,null,null,null,null,null,null,null,null,null,null,null,null,null,null,null,null,{"$error":"#NAME?"},{"$error":"#NAME?"}]
[null,null,null,null,null,null,null,null,null,null,null,null,null,null,null,null,null,null,null,null,null,null,null,{"$error":"#NAME?"},{"$error":"#NAME?"}]
[null,null,null,null,null,null,null,null,null,null,null,null,null,null,null,null,null,null,null,null,null,null,null,{"$error":"#NAME?"},{"$error":"#NAME?"}]
[null,null,null,null,null,null,null,null,null,null,null,null,null,null,null,null,null,null,null,null,null,null,null,{"$error":"#NAME?"},{"$error":"#NAME?"}]
[null,null,null,null,null,null,null,null,null,null,null,null,null,null,null,null,null,null,null,null,null,null,null,{"$error":"#NAME?"},{"$error":"#NAME?"}]
[null,null,null,null,null,null,null,null,null,null,null,null,null,null,null,null,null,null,null,null,null,null,null,{"$error":"#NAME?"},{"$error":"#NAME?"}]
[null,null,null,null,null,null,null,null,null,null,null,null,null,null,null,null,null,null,null,null,null,null,null,{"$error":"#NAME?"},{"$error":"#NAME?"}]
[null,null,null,null,null,null,null,null,null,null,null,null,null,null,null,null,null,null,null,null,null,null,null,{"$error":"#NAME?"},{"$error":"#NAME?"}]
[null,null,null,null,null,null,null,null,null,null,null,null,null,null,null,null,null,null,null,null,null,null,null,{"$error":"#NAME?"},{"$error":"#NAME?"}]
[null,null,null,null,null,null,null,null,null,null,null,null,null,null,null,null,null,null,null,null,null,null,null,{"$error":"#NAME?"},{"$error":"#NAME?"}]
[null,null,null,null,null,null,null,null,null,null,null,null,null,null,null,null,null,null,null,null,null,null,null,{"$error":"#NAME?"},{"$error":"#NAME?"}]
[null,null,null,null,null,null,null,null,null,null,null,null,null,null,null,null,null,null,null,null,null,null,null,{"$error":"#NAME?"},{"$error":"#NAME?"}]
[null,null,null,null,null,null,null,null,null,null,null,null,null,null,null,null,null,null,null,null,null,null,null,{"$error":"#NAME?"},{"$error":"#NAME?"}]
[null,null,null,null,null,null,null,null,null,null,null,null,null,null,null,null,null,null,null,null,null,null,null,{"$error":"#NAME?"},{"$error":"#NAME?"}]
[null,null,null,null,null,null,null,null,null,null,null,null,null,null,null,null,null,null,null,null,null,null,null,{"$error":"#NAME?"},{"$error":"#NAME?"}]
[null,null,null,null,null,null,null,null,null,null,null,null,null,null,null,null,null,null,null,null,null,null,null,{"$error":"#NAME?"},{"$error":"#NAME?"}]
[null,null,null,null,null,null,null,null,null,null,null,null,null,null,null,null,null,null,null,null,null,null,null,{"$error":"#NAME?"},{"$error":"#NAME?"}]
[null,null,null,null,null,null,null,null,null,null,null,null,null,null,null,null,null,null,null,null,null,null,null,{"$error":"#NAME?"},{"$error":"#NAME?"}]
[null,null,null,null,null,null,null,null,null,null,null,null,null,null,null,null,null,null,null,null,null,null,null,{"$error":"#NAME?"},{"$error":"#NAME?"}]
[null,null,null,null,null,null,null,null,null,null,null,null,null,null,null,null,null,null,null,null,null,null,null,{"$error":"#NAME?"},{"$error":"#NAME?"}]
[null,null,null,null,null,null,null,null,null,null,null,null,null,null,null,null,null,null,null,null,null,null,null,{"$error":"#NAME?"},{"$error":"#NAME?"}]
[null,null,null,null,null,null,null,null,null,null,null,null,null,null,null,null,null,null,null,null,null,null,null,{"$error":"#NAME?"},{"$error":"#NAME?"}]
[null,null,null,null,null,null,null,null,null,null,null,null,null,null,null,null,null,null,null,null,null,null,null,{"$error":"#NAME?"},{"$error":"#NAME?"}]
[null,null,null,null,null,null,null,null,null,null,null,null,null,null,null,null,null,null,null,null,null,null,null,{"$error":"#NAME?"},{"$error":"#NAME?"}]
[null,null,null,null,null,null,null,null,null,null,null,null,null,null,null,null,null,null,null,null,null,null,null,{"$error":"#NAME?"},{"$error":"#NAME?"}]
[null,null,null,null,null,null,null,null,null,null,null,null,null,null,null,null,null,null,null,null,null,null,null,{"$error":"#NAME?"},{"$error":"#NAME?"}]
[null,null,null,null,null,null,null,null,null,null,null,null,null,null,null,null,null,null,null,null,null,null,null,{"$error":"#NAME?"},{"$error":"#NAME?"}]
[null,null,null,null,null,null,null,null,null,null,null,null,null,null,null,null,null,null,null,null,null,null,null,{"$error":"#NAME?"},{"$error":"#NAME?"}]
[null,null,null,null,null,null,null,null,null,null,null,null,null,null,null,null,null,null,null,null,null,null,null,{"$error":"#NAME?"},{"$error":"#NAME?"}]
[null,null,null,null,null,null,null,null,null,null,null,null,null,null,null,null,null,null,null,null,null,null,null,{"$error":"#NAME?"},{"$error":"#NAME?"}]
[null,null,null,null,null,null,null,null,null,null,null,null,null,null,null,null,null,null,null,null,null,null,null,{"$error":"#NAME?"},{"$error":"#NAME?"}]
[null,null,null,null,null,null,null,null,null,null,null,null,null,null,null,null,null,null,null,null,null,null,null,{"$error":"#NAME?"},{"$error":"#NAME?"}]
[null,null,null,null,null,null,null,null,null,null,null,null,null,null,null,null,null,null,null,null,null,null,null,{"$error":"#NAME?"},{"$error":"#NAME?"}]
[null,null,null,null,null,null,null,null,null,null,null,null,null,null,null,null,null,null,null,null,null,null,null,{"$error":"#NAME?"},{"$error":"#NAME?"}]
[null,null,null,null,null,null,null,null,null,null,null,null,null,null,null,null,null,null,null,null,null,null,null,{"$error":"#NAME?"},{"$error":"#NAME?"}]
[null,null,null,null,null,null,null,null,null,null,null,null,null,null,null,null,null,null,null,null,null,null,null,{"$error":"#NAME?"},{"$error":"#NAME?"}]
[null,null,null,null,null,null,null,null,null,null,null,null,null,null,null,null,null,null,null,null,null,null,null,{"$error":"#NAME?"},{"$error":"#NAME?"}]
[null,null,null,null,null,null,null,null,null,null,null,null,null,null,null,null,null,null,null,null,null,null,null,{"$error":"#NAME?"},{"$error":"#NAME?"}]
[null,null,null,null,null,null,null,null,null,null,null,null,null,null,null,null,null,null,null,null,null,null,null,{"$error":"#NAME?"},{"$error":"#NAME?"}]
[null,null,null,null,null,null,null,null,null,null,null,null,null,null,null,null,null,null,null,null,null,null,null,{"$error":"#NAME?"},{"$error":"#NAME?"}]
[null,null,null,null,null,null,null,null,null,null,null,null,null,null,null,null,null,null,null,null,null,null,null,{"$error":"#NAME?"},{"$error":"#NAME?"}]
[null,null,null,null,null,null,null,null,null,null,null,null,null,null,null,null,null,null,null,null,null,null,null,{"$error":"#NAME?"},{"$error":"#NAME?"}]
[null,null,null,null,null,null,null,null,null,null,null,null,null,null,null,null,null,null,null,null,null,null,null,{"$error":"#NAME?"},{"$error":"#NAME?"}]
[null,null,null,null,null,null,null,null,null,null,null,null,null,null,null,null,null,null,null,null,null,null,null,{"$error":"#NAME?"},{"$error":"#NAME?"}]
[null,null,null,null,null,null,null,null,null,null,null,null,null,null,null,null,null,null,null,null,null,null,null,{"$error":"#NAME?"},{"$error":"#NAME?"}]
[null,null,null,null,null,null,null,null,null,null,null,null,null,null,null,null,null,null,null,null,null,null,null,{"$error":"#NAME?"},{"$error":"#NAME?"}]
[null,null,null,null,null,null,null,null,null,null,null,null,null,null,null,null,null,null,null,null,null,null,null,{"$error":"#NAME?"},{"$error":"#NAME?"}]
[null,null,null,null,null,null,null,null,null,null,null,null,null,null,null,null,null,null,null,null,null,null,null,{"$error":"#NAME?"},{"$error":"#NAME?"}]
[null,null,null,null,null,null,null,null,null,null,null,null,null,null,null,null,null,null,null,null,null,null,null,{"$error":"#NAME?"},{"$error":"#NAME?"}]
[null,null,null,null,null,null,null,null,null,null,null,null,null,null,null,null,null,null,null,null,null,null,null,{"$error":"#NAME?"},{"$error":"#NAME?"}]
[null,null,null,null,null,null,null,null,null,null,null,null,null,null,null,null,null,null,null,null,null,null,null,{"$error":"#NAME?"},{"$error":"#NAME?"}]
[null,null,null,null,null,null,null,null,null,null,null,null,null,null,null,null,null,null,null,null,null,null,null,{"$error":"#NAME?"},{"$error":"#NAME?"}]
[null,null,null,null,null,null,null,null,null,null,null,null,null,null,null,null,null,null,null,null,null,null,null,{"$error":"#NAME?"},{"$error":"#NAME?"}]
[null,null,null,null,null,null,null,null,null,null,null,null,null,null,null,null,null,null,null,null,null,null,null,{"$error":"#NAME?"},{"$error":"#NAME?"}]
[null,null,null,null,null,null,null,null,null,null,null,null,null,null,null,null,null,null,null,null,null,null,null,{"$error":"#NAME?"},{"$error":"#NAME?"}]
[null,null,null,null,null,null,null,null,null,null,null,null,null,null,null,null,null,null,null,null,null,null,null,{"$error":"#NAME?"},{"$error":"#NAME?"}]
[null,null,null,null,null,null,null,null,null,null,null,null,null,null,null,null,null,null,null,null,null,null,null,{"$error":"#NAME?"},{"$error":"#NAME?"}]
[null,null,null,null,null,null,null,null,null,null,null,null,null,null,null,null,null,null,null,null,null,null,null,{"$error":"#NAME?"},{"$error":"#NAME?"}]
[null,null,null,null,null,null,null,null,null,null,null,null,null,null,null,null,null,null,null,null,null,null,null,{"$error":"#NAME?"},{"$error":"#NAME?"}]
[null,null,null,null,null,null,null,null,null,null,null,null,null,null,null,null,null,null,null,null,null,null,null,{"$error":"#NAME?"},{"$error":"#NAME?"}]
[null,null,null,null,null,null,null,null,null,null,null,null,null,null,null,null,null,null,null,null,null,null,null,{"$error":"#NAME?"},{"$error":"#NAME?"}]
[null,null,null,null,null,null,null,null,null,null,null,null,null,null,null,null,null,null,null,null,null,null,null,{"$error":"#NAME?"},{"$error":"#NAME?"}]
[null,null,null,null,null,null,null,null,null,null,null,null,null,null,null,null,null,null,null,null,null,null,null,{"$error":"#NAME?"},{"$error":"#NAME?"}]
[null,null,null,null,null,null,null,null,null,null,null,null,null,null,null,null,null,null,null,null,null,null,null,{"$error":"#NAME?"},{"$error":"#NAME?"}]
[null,null,null,null,null,null,null,null,null,null,null,null,null,null,null,null,null,null,null,null,null,null,null,{"$error":"#NAME?"},{"$error":"#NAME?"}]
[null,null,null,null,null,null,null,null,null,null,null,null,null,null,null,null,null,null,null,null,null,null,null,{"$error":"#NAME?"},{"$error":"#NAME?"}]
[null,null,null,null,null,null,null,null,null,null,null,null,null,null,null,null,null,null,null,null,null,null,null,{"$error":"#NAME?"},{"$error":"#NAME?"}]
[null,null,null,null,null,null,null,null,null,null,null,null,null,null,null,null,null,null,null,null,null,null,null,{"$error":"#NAME?"},{"$error":"#NAME?"}]
[null,null,null,null,null,null,null,null,null,null,null,null,null,null,null,null,null,null,null,null,null,null,null,{"$error":"#NAME?"},{"$error":"#NAME?"}]
[null,null,null,null,null,null,null,null,null,null,null,null,null,null,null,null,null,null,null,null,null,null,null,{"$error":"#NAME?"},{"$error":"#NAME?"}]
[null,null,null,null,null,null,null,null,null,null,null,null,null,null,null,null,null,null,null,null,null,null,null,{"$error":"#NAME?"},{"$error":"#NAME?"}]
[null,null,null,null,null,null,null,null,null,null,null,null,null,null,null,null,null,null,null,null,null,null,null,{"$error":"#NAME?"},{"$error":"#NAME?"}]
[null,null,null,null,null,null,null,null,null,null,null,null,null,null,null,null,null,null,null,null,null,null,null,{"$error":"#NAME?"},{"$error":"#NAME?"}]
[null,null,null,null,null,null,null,null,null,null,null,null,null,null,null,null,null,null,null,null,null,null,null,{"$error":"#NAME?"},{"$error":"#NAME?"}]
[null,null,null,null,null,null,null,null,null,null,null,null,null,null,null,null,null,null,null,null,null,null,null,{"$error":"#NAME?"},{"$error":"#NAME?"}]
[null,null,null,null,null,null,null,null,null,null,null,null,null,null,null,null,null,null,null,null,null,null,null,{"$error":"#NAME?"},{"$error":"#NAME?"}]
[null,null,null,null,null,null,null,null,null,null,null,null,null,null,null,null,null,null,null,null,null,null,null,{"$error":"#NAME?"},{"$error":"#NAME?"}]
[null,null,null,null,null,null,null,null,null,null,null,null,null,null,null,null,null,null,null,null,null,null,null,{"$error":"#NAME?"},{"$error":"#NAME?"}]
[null,null,null,null,null,null,null,null,null,null,null,null,null,null,null,null,null,null,null,null,null,null,null,{"$error":"#NAME?"},{"$error":"#NAME?"}]
[null,null,null,null,null,null,null,null,null,null,null,null,null,null,null,null,null,null,null,null,null,null,null,{"$error":"#NAME?"},{"$error":"#NAME?"}]
[null,null,null,null,null,null,null,null,null,null,null,null,null,null,null,null,null,null,null,null,null,null,null,{"$error":"#NAME?"},{"$error":"#NAME?"}]
[null,null,null,null,null,null,null,null,null,null,null,null,null,null,null,null,null,null,null,null,null,null,null,{"$error":"#NAME?"},{"$error":"#NAME?"}]
[null,null,null,null,null,null,null,null,null,null,null,null,null,null,null,null,null,null,null,null,null,null,null,{"$error":"#NAME?"},{"$error":"#NAME?"}]
[null,null,null,null,null,null,null,null,null,null,null,null,null,null,null,null,null,null,null,null,null,null,null,{"$error":"#NAME?"},{"$error":"#NAME?"}]
[null,null,null,null,null,null,null,null,null,null,null,null,null,null,null,null,null,null,null,null,null,null,null,{"$error":"#NAME?"},{"$error":"#NAME?"}]
[null,null,null,null,null,null,null,null,null,null,null,null,null,null,null,null,null,null,null,null,null,null,null,{"$error":"#NAME?"},{"$error":"#NAME?"}]
[null,null,null,null,null,null,null,null,null,null,null,null,null,null,null,null,null,null,null,null,null,null,null,{"$error":"#NAME?"},{"$error":"#NAME?"}]
[null,null,null,null,null,null,null,null,null,null,null,null,null,null,null,null,null,null,null,null,null,null,null,{"$error":"#NAME?"},{"$error":"#NAME?"}]
[null,null,null,null,null,null,null,null,null,null,null,null,null,null,null,null,null,null,null,null,null,null,null,{"$error":"#NAME?"},{"$error":"#NAME?"}]
[null,null,null,null,null,null,null,null,null,null,null,null,null,null,null,null,null,null,null,null,null,null,null,{"$error":"#NAME?"},{"$error":"#NAME?"}]
[null,null,null,null,null,null,null,null,null,null,null,null,null,null,null,null,null,null,null,null,null,null,null,{"$error":"#NAME?"},{"$error":"#NAME?"}]
[null,null,null,null,null,null,null,null,null,null,null,null,null,null,null,null,null,null,null,null,null,null,null,{"$error":"#NAME?"},{"$error":"#NAME?"}]
[null,null,null,null,null,null,null,null,null,null,null,null,null,null,null,null,null,null,null,null,null,null,null,{"$error":"#NAME?"},{"$error":"#NAME?"}]
[null,null,null,null,null,null,null,null,null,null,null,null,null,null,null,null,null,null,null,null,null,null,null,{"$error":"#NAME?"},{"$error":"#NAME?"}]
[null,null,null,null,null,null,null,null,null,null,null,null,null,null,null,null,null,null,null,null,null,null,null,{"$error":"#NAME?"},{"$error":"#NAME?"}]
[null,null,null,null,null,null,null,null,null,null,null,null,null,null,null,null,null,null,null,null,null,null,null,{"$error":"#NAME?"},{"$error":"#NAME?"}]
[null,null,null,null,null,null,null,null,null,null,null,null,null,null,null,null,null,null,null,null,null,null,null,{"$error":"#NAME?"},{"$error":"#NAME?"}]
[null,null,null,null,null,null,null,null,null,null,null,null,null,null,null,null,null,null,null,null,null,null,null,{"$error":"#NAME?"},{"$error":"#NAME?"}]
[null,null,null,null,null,null,null,null,null,null,null,null,null,null,null,null,null,null,null,null,null,null,null,{"$error":"#NAME?"},{"$error":"#NAME?"}]
[null,null,null,null,null,null,null,null,null,null,null,null,null,null,null,null,null,null,null,null,null,null,null,{"$error":"#NAME?"},{"$error":"#NAME?"}]
[null,null,null,null,null,null,null,null,null,null,null,null,null,null,null,null,null,null,null,null,null,null,null,{"$error":"#NAME?"},{"$error":"#NAME?"}]
[null,null,null,null,null,null,null,null,null,null,null,null,null,null,null,null,null,null,null,null,null,null,null,{"$error":"#NAME?"},{"$error":"#NAME?"}]
[null,null,null,null,null,null,null,null,null,null,null,null,null,null,null,null,null,null,null,null,null,null,null,{"$error":"#NAME?"},{"$error":"#NAME?"}]
[null,null,null,null,null,null,null,null,null,null,null,null,null,null,null,null,null,null,null,null,null,null,null,{"$error":"#NAME?"},{"$error":"#NAME?"}]
[null,null,null,null,null,null,null,null,null,null,null,null,null,null,null,null,null,null,null,null,null,null,null,{"$error":"#NAME?"},{"$error":"#NAME?"}]
[null,null,null,null,null,null,null,null,null,null,null,null,null,null,null,null,null,null,null,null,null,null,null,{"$error":"#NAME?"},{"$error":"#NAME?"}]
[null,null,null,null,null,null,null,null,null,null,null,null,null,null,null,null,null,null,null,null,null,null,null,{"$error":"#NAME?"},{"$error":"#NAME?"}]
[null,null,null,null,null,null,null,null,null,null,null,null,null,null,null,null,null,null,null,null,null,null,null,{"$error":"#NAME?"},{"$error":"#NAME?"}]
[null,null,null,null,null,null,null,null,null,null,null,null,null,null,null,null,null,null,null,null,null,null,null,{"$error":"#NAME?"},{"$error":"#NAME?"}]
[null,null,null,null,null,null,null,null,null,null,null,null,null,null,null,null,null,null,null,null,null,null,null,{"$error":"#NAME?"},{"$error":"#NAME?"}]
[null,null,null,null,null,null,null,null,null,null,null,null,null,null,null,null,null,null,null,null,null,null,null,{"$error":"#NAME?"},{"$error":"#NAME?"}]
[null,null,null,null,null,null,null,null,null,null,null,null,null,null,null,null,null,null,null,null,null,null,null,{"$error":"#NAME?"},{"$error":"#NAME?"}]
[null,null,null,null,null,null,null,null,null,null,null,null,null,null,null,null,null,null,null,null,null,null,null,{"$error":"#NAME?"},{"$error":"#NAME?"}]
[null,null,null,null,null,null,null,null,null,null,null,null,null,null,null,null,null,null,null,null,null,null,null,{"$error":"#NAME?"},{"$error":"#NAME?"}]
[null,null,null,null,null,null,null,null,null,null,null,null,null,null,null,null,null,null,null,null,null,null,null,{"$error":"#NAME?"},{"$error":"#NAME?"}]
[null,null,null,null,null,null,null,null,null,null,null,null,null,null,null,null,null,null,null,null,null,null,null,{"$error":"#NAME?"},{"$error":"#NAME?"}]
[null,null,null,null,null,null,null,null,null,null,null,null,null,null,null,null,null,null,null,null,null,null,null,{"$error":"#NAME?"},{"$error":"#NAME?"}]
[null,null,null,null,null,null,null,null,null,null,null,null,null,null,null,null,null,null,null,null,null,null,null,{"$error":"#NAME?"},{"$error":"#NAME?"}]
[null,null,null,null,null,null,null,null,null,null,null,null,null,null,null,null,null,null,null,null,null,null,null,{"$error":"#NAME?"},{"$error":"#NAME?"}]
[null,null,null,null,null,null,null,null,null,null,null,null,null,null,null,null,null,null,null,null,null,null,null,{"$error":"#NAME?"},{"$error":"#NAME?"}]
[null,null,null,null,null,null,null,null,null,null,null,null,null,null,null,null,null,null,null,null,null,null,null,{"$error":"#NAME?"},{"$error":"#NAME?"}]
[null,null,null,null,null,null,null,null,null,null,null,null,null,null,null,null,null,null,null,null,null,null,null,{"$error":"#NAME?"},{"$error":"#NAME?"}]
[null,null,null,null,null,null,null,null,null,null,null,null,null,null,null,null,null,null,null,null,null,null,null,{"$error":"#NAME?"},{"$error":"#NAME?"}]
[null,null,null,null,null,null,null,null,null,null,null,null,null,null,null,null,null,null,null,null,null,null,null,{"$error":"#NAME?"},{"$error":"#NAME?"}]
[null,null,null,null,null,null,null,null,null,null,null,null,null,null,null,null,null,null,null,null,null,null,null,{"$error":"#NAME?"},{"$error":"#NAME?"}]
[null,null,null,null,null,null,null,null,null,null,null,null,null,null,null,null,null,null,null,null,null,null,null,{"$error":"#NAME?"},{"$error":"#NAME?"}]
[null,null,null,null,null,null,null,null,null,null,null,null,null,null,null,null,null,null,null,null,null,null,null,{"$error":"#NAME?"},{"$error":"#NAME?"}]
[null,null,null,null,null,null,null,null,null,null,null,null,null,null,null,null,null,null,null,null,null,null,null,{"$error":"#NAME?"},{"$error":"#NAME?"}]
[null,null,null,null,null,null,null,null,null,null,null,null,null,null,null,null,null,null,null,null,null,null,null,{"$error":"#NAME?"},{"$error":"#NAME?"}]
[null,null,null,null,null,null,null,null,null,null,null,null,null,null,null,null,null,null,null,null,null,null,null,{"$error":"#NAME?"},{"$error":"#NAME?"}]
[null,null,null,null,null,null,null,null,null,null,null,null,null,null,null,null,null,null,null,null,null,null,null,{"$error":"#NAME?"},{"$error":"#NAME?"}]
[null,null,null,null,null,null,null,null,null,null,null,null,null,null,null,null,null,null,null,null,null,null,null,{"$error":"#NAME?"},{"$error":"#NAME?"}]
[null,null,null,null,null,null,null,null,null,null,null,null,null,null,null,null,null,null,null,null,null,null,null,{"$error":"#NAME?"},{"$error":"#NAME?"}]
[null,null,null,null,null,null,null,null,null,null,null,null,null,null,null,null,null,null,null,null,null,null,null,{"$error":"#NAME?"},{"$error":"#NAME?"}]
[null,null,null,null,null,null,null,null,null,null,null,null,null,null,null,null,null,null,null,null,null,null,null,{"$error":"#NAME?"},{"$error":"#NAME?"}]
[null,null,null,null,null,null,null,null,null,null,null,null,null,null,null,null,null,null,null,null,null,null,null,{"$error":"#NAME?"},{"$error":"#NAME?"}]
[null,null,null,null,null,null,null,null,null,null,null,null,null,null,null,null,null,null,null,null,null,null,null,{"$error":"#NAME?"},{"$error":"#NAME?"}]
[null,null,null,null,null,null,null,null,null,null,null,null,null,null,null,null,null,null,null,null,null,null,null,{"$error":"#NAME?"},{"$error":"#NAME?"}]
[null,null,null,null,null,null,null,null,null,null,null,null,null,null,null,null,null,null,null,null,null,null,null,{"$error":"#NAME?"},{"$error":"#NAME?"}]
[null,null,null,null,null,null,null,null,null,null,null,null,null,null,null,null,null,null,null,null,null,null,null,{"$error":"#NAME?"},{"$error":"#NAME?"}]
[null,null,null,null,null,null,null,null,null,null,null,null,null,null,null,null,null,null,null,null,null,null,null,{"$error":"#NAME?"},{"$error":"#NAME?"}]
[null,null,null,null,null,null,null,null,null,null,null,null,null,null,null,null,null,null,null,null,null,null,null,{"$error":"#NAME?"},{"$error":"#NAME?"}]
[null,null,null,null,null,null,null,null,null,null,null,null,null,null,null,null,null,null,null,null,null,null,null,{"$error":"#NAME?"},{"$error":"#NAME?"}]
[null,null,null,null,null,null,null,null,null,null,null,null,null,null,null,null,null,null,null,null,null,null,null,{"$error":"#NAME?"},{"$error":"#NAME?"}]
[null,null,null,null,null,null,null,null,null,null,null,null,null,null,null,null,null,null,null,null,null,null,null,{"$error":"#NAME?"},{"$error":"#NAME?"}]
[null,null,null,null,null,null,null,null,null,null,null,null,null,null,null,null,null,null,null,null,null,null,null,{"$error":"#NAME?"},{"$error":"#NAME?"}]
[null,null,null,null,null,null,null,null,null,null,null,null,null,null,null,null,null,null,null,null,null,null,null,{"$error":"#NAME?"},{"$error":"#NAME?"}]
[null,null,null,null,null,null,null,null,null,null,null,null,null,null,null,null,null,null,null,null,null,null,null,{"$error":"#NAME?"},{"$error":"#NAME?"}]
[null,null,null,null,null,null,null,null,null,null,null,null,null,null,null,null,null,null,null,null,null,null,null,{"$error":"#NAME?"},{"$error":"#NAME?"}]
[null,null,null,null,null,null,null,null,null,null,null,null,null,null,null,null,null,null,null,null,null,null,null,{"$error":"#NAME?"},{"$error":"#NAME?"}]
[null,null,null,null,null,null,null,null,null,null,null,null,null,null,null,null,null,null,null,null,null,null,null,{"$error":"#NAME?"},{"$error":"#NAME?"}]
[null,null,null,null,null,null,null,null,null,null,null,null,null,null,null,null,null,null,null,null,null,null,null,{"$error":"#NAME?"},{"$error":"#NAME?"}]
[null,null,null,null,null,null,null,null,null,null,null,null,null,null,null,null,null,null,null,null,null,null,null,{"$error":"#NAME?"},{"$error":"#NAME?"}]
[null,null,null,null,null,null,null,null,null,null,null,null,null,null,null,null,null,null,null,null,null,null,null,{"$error":"#NAME?"},{"$error":"#NAME?"}]
[null,null,null,null,null,null,null,null,null,null,null,null,null,null,null,null,null,null,null,null,null,null,null,{"$error":"#NAME?"},{"$error":"#NAME?"}]
[null,null,null,null,null,null,null,null,null,null,null,null,null,null,null,null,null,null,null,null,null,null,null,{"$error":"#NAME?"},{"$error":"#NAME?"}]
[null,null,null,null,null,null,null,null,null,null,null,null,null,null,null,null,null,null,null,null,null,null,null,{"$error":"#NAME?"},{"$error":"#NAME?"}]
[null,null,null,null,null,null,null,null,null,null,null,null,null,null,null,null,null,null,null,null,null,null,null,{"$error":"#NAME?"},{"$error":"#NAME?"}]
[null,null,null,null,null,null,null,null,null,null,null,null,null,null,null,null,null,null,null,null,null,null,null,{"$error":"#NAME?"},{"$error":"#NAME?"}]
[null,null,null,null,null,null,null,null,null,null,null,null,null,null,null,null,null,null,null,null,null,null,null,{"$error":"#NAME?"},{"$error":"#NAME?"}]
[null,null,null,null,null,null,null,null,null,null,null,null,null,null,null,null,null,null,null,null,null,null,null,{"$error":"#NAME?"},{"$error":"#NAME?"}]
[null,null,null,null,null,null,null,null,null,null,null,null,null,null,null,null,null,null,null,null,null,null,null,{"$error":"#NAME?"},{"$error":"#NAME?"}]
[null,null,null,null,null,null,null,null,null,null,null,null,null,null,null,null,null,null,null,null,null,null,null,{"$error":"#NAME?"},{"$error":"#NAME?"}]
[null,null,null,null,null,null,null,null,null,null,null,null,null,null,null,null,null,null,null,null,null,null,null,{"$error":"#NAME?"},{"$error":"#NAME?"}]
[null,null,null,null,null,null,null,null,null,null,null,null,null,null,null,null,null,null,null,null,null,null,null,{"$error":"#NAME?"},{"$error":"#NAME?"}]
[null,null,null,null,null,null,null,null,null,null,null,null,null,null,null,null,null,null,null,null,null,null,null,{"$error":"#NAME?"},{"$error":"#NAME?"}]
[null,null,null,null,null,null,null,null,null,null,null,null,null,null,null,null,null,null,null,null,null,null,null,{"$error":"#NAME?"},{"$error":"#NAME?"}]
[null,null,null,null,null,null,null,null,null,null,null,null,null,null,null,null,null,null,null,null,null,null,null,{"$error":"#NAME?"},{"$error":"#NAME?"}]
[null,null,null,null,null,null,null,null,null,null,null,null,null,null,null,null,null,null,null,null,null,null,null,{"$error":"#NAME?"},{"$error":"#NAME?"}]
[null,null,null,null,null,null,null,null,null,null,null,null,null,null,null,null,null,null,null,null,null,null,null,{"$error":"#NAME?"},{"$error":"#NAME?"}]
[null,null,null,null,null,null,null,null,null,null,null,null,null,null,null,null,null,null,null,null,null,null,null,{"$error":"#NAME?"},{"$error":"#NAME?"}]
[null,null,null,null,null,null,null,null,null,null,null,null,null,null,null,null,null,null,null,null,null,null,null,{"$error":"#NAME?"},{"$error":"#NAME?"}]
[null,null,null,null,null,null,null,null,null,null,null,null,null,null,null,null,null,null,null,null,null,null,null,{"$error":"#NAME?"},{"$error":"#NAME?"}]
[null,null,null,null,null,null,null,null,null,null,null,null,null,null,null,null,null,null,null,null,null,null,null,{"$error":"#NAME?"},{"$error":"#NAME?"}]
[null,null,null,null,null,null,null,null,null,null,null,null,null,null,null,null,null,null,null,null,null,null,null,{"$error":"#NAME?"},{"$error":"#NAME?"}]
[null,null,null,null,null,null,null,null,null,null,null,null,null,null,null,null,null,null,null,null,null,null,null,{"$error":"#NAME?"},{"$error":"#NAME?"}]
[null,null,null,null,null,null,null,null,null,null,null,null,null,null,null,null,null,null,null,null,null,null,null,{"$error":"#NAME?"},{"$error":"#NAME?"}]
[null,null,null,null,null,null,null,null,null,null,null,null,null,null,null,null,null,null,null,null,null,null,null,{"$error":"#NAME?"},{"$error":"#NAME?"}]
[null,null,null,null,null,null,null,null,null,null,null,null,null,null,null,null,null,null,null,null,null,null,null,{"$error":"#NAME?"},{"$error":"#NAME?"}]
[null,null,null,null,null,null,null,null,null,null,null,null,null,null,null,null,null,null,null,null,null,null,null,{"$error":"#NAME?"},{"$error":"#NAME?"}]
[null,null,null,null,null,null,null,null,null,null,null,null,null,null,null,null,null,null,null,null,null,null,null,{"$error":"#NAME?"},{"$error":"#NAME?"}]
[null,null,null,null,null,null,null,null,null,null,null,null,null,null,null,null,null,null,null,null,null,null,null,{"$error":"#NAME?"},{"$error":"#NAME?"}]
[null,null,null,null,null,null,null,null,null,null,null,null,null,null,null,null,null,null,null,null,null,null,null,{"$error":"#NAME?"},{"$error":"#NAME?"}]
[null,null,null,null,null,null,null,null,null,null,null,null,null,null,null,null,null,null,null,null,null,null,null,{"$error":"#NAME?"},{"$error":"#NAME?"}]
[null,null,null,null,null,null,null,null,null,null,null,null,null,null,null,null,null,null,null,null,null,null,null,{"$error":"#NAME?"},{"$error":"#NAME?"}]
[null,null,null,null,null,null,null,null,null,null,null,null,null,null,null,null,null,null,null,null,null,null,null,{"$error":"#NAME?"},{"$error":"#NAME?"}]
[null,null,null,null,null,null,null,null,null,null,null,null,null,null,null,null,null,null,null,null,null,null,null,{"$error":"#NAME?"},{"$error":"#NAME?"}]
[null,null,null,null,null,null,null,null,null,null,null,null,null,null,null,null,null,null,null,null,null,null,null,{"$error":"#NAME?"},{"$error":"#NAME?"}]
[null,null,null,null,null,null,null,null,null,null,null,null,null,null,null,null,null,null,null,null,null,null,null,{"$error":"#NAME?"},{"$error":"#NAME?"}]
[null,null,null,null,null,null,null,null,null,null,null,null,null,null,null,null,null,null,null,null,null,null,null,{"$error":"#NAME?"},{"$error":"#NAME?"}]
[null,null,null,null,null,null,null,null,null,null,null,null,null,null,null,null,null,null,null,null,null,null,null,{"$error":"#NAME?"},{"$error":"#NAME?"}]
[null,null,null,null,null,null,null,null,null,null,null,null,null,null,null,null,null,null,null,null,null,null,null,{"$error":"#NAME?"},{"$error":"#NAME?"}]
[null,null,null,null,null,null,null,null,null,null,null,null,null,null,null,null,null,null,null,null,null,null,null,{"$error":"#NAME?"},{"$error":"#NAME?"}]
[null,null,null,null,null,null,null,null,null,null,null,null,null,null,null,null,null,null,null,null,null,null,null,{"$error":"#NAME?"},{"$error":"#NAME?"}]
[null,null,null,null,null,null,null,null,null,null,null,null,null,null,null,null,null,null,null,null,null,null,null,{"$error":"#NAME?"},{"$error":"#NAME?"}]
[null,null,null,null,null,null,null,null,null,null,null,null,null,null,null,null,null,null,null,null,null,null,null,{"$error":"#NAME?"},{"$error":"#NAME?"}]
[null,null,null,null,null,null,null,null,null,null,null,null,null,null,null,null,null,null,null,null,null,null,null,{"$error":"#NAME?"},{"$error":"#NAME?"}]
[null,null,null,null,null,null,null,null,null,null,null,null,null,null,null,null,null,null,null,null,null,null,null,{"$error":"#NAME?"},{"$error":"#NAME?"}]
[null,null,null,null,null,null,null,null,null,null,null,null,null,null,null,null,null,null,null,null,null,null,null,{"$error":"#NAME?"},{"$error":"#NAME?"}]
[null,null,null,null,null,null,null,null,null,null,null,null,null,null,null,null,null,null,null,null,null,null,null,{"$error":"#NAME?"},{"$error":"#NAME?"}]
[null,null,null,null,null,null,null,null,null,null,null,null,null,null,null,null,null,null,null,null,null,null,null,{"$error":"#NAME?"},{"$error":"#NAME?"}]
[null,null,null,null,null,null,null,null,null,null,null,null,null,null,null,null,null,null,null,null,null,null,null,{"$error":"#NAME?"},{"$error":"#NAME?"}]
[null,null,null,null,null,null,null,null,null,null,null,null,null,null,null,null,null,null,null,null,null,null,null,{"$error":"#NAME?"},{"$error":"#NAME?"}]
[null,null,null,null,null,null,null,null,null,null,null,null,null,null,null,null,null,null,null,null,null,null,null,{"$error":"#NAME?"},{"$error":"#NAME?"}]
[null,null,null,null,null,null,null,null,null,null,null,null,null,null,null,null,null,null,null,null,null,null,null,{"$error":"#NAME?"},{"$error":"#NAME?"}]
[null,null,null,null,null,null,null,null,null,null,null,null,null,null,null,null,null,null,null,null,null,null,null,{"$error":"#NAME?"},{"$error":"#NAME?"}]
[null,null,null,null,null,null,null,null,null,null,null,null,null,null,null,null,null,null,null,null,null,null,null,{"$error":"#NAME?"},{"$error":"#NAME?"}]
[null,null,null,null,null,null,null,null,null,null,null,null,null,null,null,null,null,null,null,null,null,null,null,{"$error":"#NAME?"},{"$error":"#NAME?"}]
[null,null,null,null,null,null,null,null,null,null,null,null,null,null,null,null,null,null,null,null,null,null,null,{"$error":"#NAME?"},{"$error":"#NAME?"}]
[null,null,null,null,null,null,null,null,null,null,null,null,null,null,null,null,null,null,null,null,null,null,null,{"$error":"#NAME?"},{"$error":"#NAME?"}]
[null,null,null,null,null,null,null,null,null,null,null,null,null,null,null,null,null,null,null,null,null,null,null,{"$error":"#NAME?"},{"$error":"#NAME?"}]
[null,null,null,null,null,null,null,null,null,null,null,null,null,null,null,null,null,null,null,null,null,null,null,{"$error":"#NAME?"},{"$error":"#NAME?"}]
[null,null,null,null,null,null,null,null,null,null,null,null,null,null,null,null,null,null,null,null,null,null,null,{"$error":"#NAME?"},{"$error":"#NAME?"}]
[null,null,null,null,null,null,null,null,null,null,null,null,null,null,null,null,null,null,null,null,null,null,null,{"$error":"#NAME?"},{"$error":"#NAME?"}]
[null,null,null,null,null,null,null,null,null,null,null,null,null,null,null,null,null,null,null,null,null,null,null,{"$error":"#NAME?"},{"$error":"#NAME?"}]
[null,null,null,null,null,null,null,null,null,null,null,null,null,null,null,null,null,null,null,null,null,null,null,{"$error":"#NAME?"},{"$error":"#NAME?"}]
[null,null,null,null,null,null,null,null,null,null,null,null,null,null,null,null,null,null,null,null,null,null,null,{"$error":"#NAME?"},{"$error":"#NAME?"}]
[null,null,null,null,null,null,null,null,null,null,null,null,null,null,null,null,null,null,null,null,null,null,null,{"$error":"#NAME?"},{"$error":"#NAME?"}]
[null,null,null,null,null,null,null,null,null,null,null,null,null,null,null,null,null,null,null,null,null,null,null,{"$error":"#NAME?"},{"$error":"#NAME?"}]
[null,null,null,null,null,null,null,null,null,null,null,null,null,null,null,null,null,null,null,null,null,null,null,{"$error":"#NAME?"},{"$error":"#NAME?"}]
[null,null,null,null,null,null,null,null,null,null,null,null,null,null,null,null,null,null,null,null,null,null,null,{"$error":"#NAME?"},{"$error":"#NAME?"}]
[null,null,null,null,null,null,null,null,null,null,null,null,null,null,null,null,null,null,null,null,null,null,null,{"$error":"#NAME?"},{"$error":"#NAME?"}]
[null,null,null,null,null,null,null,null,null,null,null,null,null,null,null,null,null,null,null,null,null,null,null,{"$error":"#NAME?"},{"$error":"#NAME?"}]
[null,null,null,null,null,null,null,null,null,null,null,null,null,null,null,null,null,null,null,null,null,null,null,{"$error":"#NAME?"},{"$error":"#NAME?"}]
[null,null,null,null,null,null,null,null,null,null,null,null,null,null,null,null,null,null,null,null,null,null,null,{"$error":"#NAME?"},{"$error":"#NAME?"}]
[null,null,null,null,null,null,null,null,null,null,null,null,null,null,null,null,null,null,null,null,null,null,null,{"$error":"#NAME?"},{"$error":"#NAME?"}]
[null,null,null,null,null,null,null,null,null,null,null,null,null,null,null,null,null,null,null,null,null,null,null,{"$error":"#NAME?"},{"$error":"#NAME?"}]
[null,null,null,null,null,null,null,null,null,null,null,null,null,null,null,null,null,null,null,null,null,null,null,{"$error":"#NAME?"},{"$error":"#NAME?"}]
[null,null,null,null,null,null,null,null,null,null,null,null,null,null,null,null,null,null,null,null,null,null,null,{"$error":"#NAME?"},{"$error":"#NAME?"}]
[null,null,null,null,null,null,null,null,null,null,null,null,null,null,null,null,null,null,null,null,null,null,null,{"$error":"#NAME?"},{"$error":"#NAME?"}]
[null,null,null,null,null,null,null,null,null,null,null,null,null,null,null,null,null,null,null,null,null,null,null,{"$error":"#NAME?"},{"$error":"#NAME?"}]
[null,null,null,null,null,null,null,null,null,null,null,null,null,null,null,null,null,null,null,null,null,null,null,{"$error":"#NAME?"},{"$error":"#NAME?"}]
[null,null,null,null,null,null,null,null,null,null,null,null,null,null,null,null,null,null,null,null,null,null,null,{"$error":"#NAME?"},{"$error":"#NAME?"}]
[null,null,null,null,null,null,null,null,null,null,null,null,null,null,null,null,null,null,null,null,null,null,null,{"$error":"#NAME?"},{"$error":"#NAME?"}]
[null,null,null,null,null,null,null,null,null,null,null,null,null,null,null,null,null,null,null,null,null,null,null,{"$error":"#NAME?"},{"$error":"#NAME?"}]
[null,null,null,null,null,null,null,null,null,null,null,null,null,null,null,null,null,null,null,null,null,null,null,{"$error":"#NAME?"},{"$error":"#NAME?"}]
[null,null,null,null,null,null,null,null,null,null,null,null,null,null,null,null,null,null,null,null,null,null,null,{"$error":"#NAME?"},{"$error":"#NAME?"}]
[null,null,null,null,null,null,null,null,null,null,null,null,null,null,null,null,null,null,null,null,null,null,null,{"$error":"#NAME?"},{"$error":"#NAME?"}]
[null,null,null,null,null,null,null,null,null,null,null,null,null,null,null,null,null,null,null,null,null,null,null,{"$error":"#NAME?"},{"$error":"#NAME?"}]
[null,null,null,null,null,null,null,null,null,null,null,null,null,null,null,null,null,null,null,null,null,null,null,{"$error":"#NAME?"},{"$error":"#NAME?"}]
[null,null,null,null,null,null,null,null,null,null,null,null,null,null,null,null,null,null,null,null,null,null,null,{"$error":"#NAME?"},{"$error":"#NAME?"}]
[null,null,null,null,null,null,null,null,null,null,null,null,null,null,null,null,null,null,null,null,null,null,null,{"$error":"#NAME?"},{"$error":"#NAME?"}]
[null,null,null,null,null,null,null,null,null,null,null,null,null,null,null,null,null,null,null,null,null,null,null,{"$error":"#NAME?"},{"$error":"#NAME?"}]
[null,null,null,null,null,null,null,null,null,null,null,null,null,null,null,null,null,null,null,null,null,null,null,{"$error":"#NAME?"},{"$error":"#NAME?"}]
[null,null,null,null,null,null,null,null,null,null,null,null,null,null,null,null,null,null,null,null,null,null,null,{"$error":"#NAME?"},{"$error":"#NAME?"}]
[null,null,null,null,null,null,null,null,null,null,null,null,null,null,null,null,null,null,null,null,null,null,null,{"$error":"#NAME?"},{"$error":"#NAME?"}]
[null,null,null,null,null,null,null,null,null,null,null,null,null,null,null,null,null,null,null,null,null,null,null,{"$error":"#NAME?"},{"$error":"#NAME?"}]
[null,null,null,null,null,null,null,null,null,null,null,null,null,null,null,null,null,null,null,null,null,null,null,{"$error":"#NAME?"},{"$error":"#NAME?"}]
[null,null,null,null,null,null,null,null,null,null,null,null,null,null,null,null,null,null,null,null,null,null,null,{"$error":"#NAME?"},{"$error":"#NAME?"}]
[null,null,null,null,null,null,null,null,null,null,null,null,null,null,null,null,null,null,null,null,null,null,null,{"$error":"#NAME?"},{"$error":"#NAME?"}]
[null,null,null,null,null,null,null,null,null,null,null,null,null,null,null,null,null,null,null,null,null,null,null,{"$error":"#NAME?"},{"$error":"#NAME?"}]
[null,null,null,null,null,null,null,null,null,null,null,null,null,null,null,null,null,null,null,null,null,null,null,{"$error":"#NAME?"},{"$error":"#NAME?"}]
[null,null,null,null,null,null,null,null,null,null,null,null,null,null,null,null,null,null,null,null,null,null,null,{"$error":"#NAME?"},{"$error":"#NAME?"}]
[null,null,null,null,null,null,null,null,null,null,null,null,null,null,null,null,null,null,null,null,null,null,null,{"$error":"#NAME?"},{"$error":"#NAME?"}]
[null,null,null,null,null,null,null,null,null,null,null,null,null,null,null,null,null,null,null,null,null,null,null,{"$error":"#NAME?"},{"$error":"#NAME?"}]
[null,null,null,null,null,null,null,null,null,null,null,null,null,null,null,null,null,null,null,null,null,null,null,{"$error":"#NAME?"},{"$error":"#NAME?"}]
[null,null,null,null,null,null,null,null,null,null,null,null,null,null,null,null,null,null,null,null,null,null,null,{"$error":"#NAME?"},{"$error":"#NAME?"}]
[null,null,null,null,null,null,null,null,null,null,null,null,null,null,null,null,null,null,null,null,null,null,null,{"$error":"#NAME?"},{"$error":"#NAME?"}]
[null,null,null,null,null,null,null,null,null,null,null,null,null,null,null,null,null,null,null,null,null,null,null,{"$error":"#NAME?"},{"$error":"#NAME?"}]
[null,null,null,null,null,null,null,null,null,null,null,null,null,null,null,null,null,null,null,null,null,null,null,{"$error":"#NAME?"},{"$error":"#NAME?"}]
[null,null,null,null,null,null,null,null,null,null,null,null,null,null,null,null,null,null,null,null,null,null,null,{"$error":"#NAME?"},{"$error":"#NAME?"}]
[null,null,null,null,null,null,null,null,null,null,null,null,null,null,null,null,null,null,null,null,null,null,null,{"$error":"#NAME?"},{"$error":"#NAME?"}]
[null,null,null,null,null,null,null,null,null,null,null,null,null,null,null,null,null,null,null,null,null,null,null,{"$error":"#NAME?"},{"$error":"#NAME?"}]
[null,null,null,null,null,null,null,null,null,null,null,null,null,null,null,null,null,null,null,null,null,null,null,{"$error":"#NAME?"},{"$error":"#NAME?"}]
[null,null,null,null,null,null,null,null,null,null,null,null,null,null,null,null,null,null,null,null,null,null,null,{"$error":"#NAME?"},{"$error":"#NAME?"}]
[null,null,null,null,null,null,null,null,null,null,null,null,null,null,null,null,null,null,null,null,null,null,null,{"$error":"#NAME?"},{"$error":"#NAME?"}]
[null,null,null,null,null,null,null,null,null,null,null,null,null,null,null,null,null,null,null,null,null,null,null,{"$error":"#NAME?"},{"$error":"#NAME?"}]
[null,null,null,null,null,null,null,null,null,null,null,null,null,null,null,null,null,null,null,null,null,null,null,{"$error":"#NAME?"},{"$error":"#NAME?"}]
[null,null,null,null,null,null,null,null,null,null,null,null,null,null,null,null,null,null,null,null,null,null,null,{"$error":"#NAME?"},{"$error":"#NAME?"}]
[null,null,null,null,null,null,null,null,null,null,null,null,null,null,null,null,null,null,null,null,null,null,null,{"$error":"#NAME?"},{"$error":"#NAME?"}]
[null,null,null,null,null,null,null,null,null,null,null,null,null,null,null,null,null,null,null,null,null,null,null,{"$error":"#NAME?"},{"$error":"#NAME?"}]
[null,null,null,null,null,null,null,null,null,null,null,null,null,null,null,null,null,null,null,null,null,null,null,{"$error":"#NAME?"},{"$error":"#NAME?"}]
[null,null,null,null,null,null,null,null,null,null,null,null,null,null,null,null,null,null,null,null,null,null,null,{"$error":"#NAME?"},{"$error":"#NAME?"}]
[null,null,null,null,null,null,null,null,null,null,null,null,null,null,null,null,null,null,null,null,null,null,null,{"$error":"#NAME?"},{"$error":"#NAME?"}]
[null,null,null,null,null,null,null,null,null,null,null,null,null,null,null,null,null,null,null,null,null,null,null,{"$error":"#NAME?"},{"$error":"#NAME?"}]
[null,null,null,null,null,null,null,null,null,null,null,null,null,null,null,null,null,null,null,null,null,null,null,{"$error":"#NAME?"},{"$error":"#NAME?"}]
[null,null,null,null,null,null,null,null,null,null,null,null,null,null,null,null,null,null,null,null,null,null,null,{"$error":"#NAME?"},{"$error":"#NAME?"}]
[null,null,null,null,null,null,null,null,null,null,null,null,null,null,null,null,null,null,null,null,null,null,null,{"$error":"#NAME?"},{"$error":"#NAME?"}]
[null,null,null,null,null,null,null,null,null,null,null,null,null,null,null,null,null,null,null,null,null,null,null,{"$error":"#NAME?"},{"$error":"#NAME?"}]
[null,null,null,null,null,null,null,null,null,null,null,null,null,null,null,null,null,null,null,null,null,null,null,{"$error":"#NAME?"},{"$error":"#NAME?"}]
[null,null,null,null,null,null,null,null,null,null,null,null,null,null,null,null,null,null,null,null,null,null,null,{"$error":"#NAME?"},{"$error":"#NAME?"}]
[null,null,null,null,null,null,null,null,null,null,null,null,null,null,null,null,null,null,null,null,null,null,null,{"$error":"#NAME?"},{"$error":"#NAME?"}]
[null,null,null,null,null,null,null,null,null,null,null,null,null,null,null,null,null,null,null,null,null,null,null,{"$error":"#NAME?"},{"$error":"#NAME?"}]
[null,null,null,null,null,null,null,null,null,null,null,null,null,null,null,null,null,null,null,null,null,null,null,{"$error":"#NAME?"},{"$error":"#NAME?"}]
[null,null,null,null,null,null,null,null,null,null,null,null,null,null,null,null,null,null,null,null,null,null,null,{"$error":"#NAME?"},{"$error":"#NAME?"}]
[null,null,null,null,null,null,null,null,null,null,null,null,null,null,null,null,null,null,null,null,null,null,null,{"$error":"#NAME?"},{"$error":"#NAME?"}]
[null,null,null,null,null,null,null,null,null,null,null,null,null,null,null,null,null,null,null,null,null,null,null,{"$error":"#NAME?"},{"$error":"#NAME?"}]
[null,null,null,null,null,null,null,null,null,null,null,null,null,null,null,null,null,null,null,null,null,null,null,{"$error":"#NAME?"},{"$error":"#NAME?"}]
[null,null,null,null,null,null,null,null,null,null,null,null,null,null,null,null,null,null,null,null,null,null,null,{"$error":"#NAME?"},{"$error":"#NAME?"}]
[null,null,null,null,null,null,null,null,null,null,null,null,null,null,null,null,null,null,null,null,null,null,null,{"$error":"#NAME?"},{"$error":"#NAME?"}]
[null,null,null,null,null,null,null,null,null,null,null,null,null,null,null,null,null,null,null,null,null,null,null,{"$error":"#NAME?"},{"$error":"#NAME?"}]
[null,null,null,null,null,null,null,null,null,null,null,null,null,null,null,null,null,null,null,null,null,null,null,{"$error":"#NAME?"},{"$error":"#NAME?"}]
[null,null,null,null,null,null,null,null,null,null,null,null,null,null,null,null,null,null,null,null,null,null,null,{"$error":"#NAME?"},{"$error":"#NAME?"}]
[null,null,null,null,null,null,null,null,null,null,null,null,null,null,null,null,null,null,null,null,null,null,null,{"$error":"#NAME?"},{"$error":"#NAME?"}]
[null,null,null,null,null,null,null,null,null,null,null,null,null,null,null,null,null,null,null,null,null,null,null,{"$error":"#NAME?"},{"$error":"#NAME?"}]
[null,null,null,null,null,null,null,null,null,null,null,null,null,null,null,null,null,null,null,null,null,null,null,{"$error":"#NAME?"},{"$error":"#NAME?"}]
[null,null,null,null,null,null,null,null,null,null,null,null,null,null,null,null,null,null,null,null,null,null,null,{"$error":"#NAME?"},{"$error":"#NAME?"}]
[null,null,null,null,null,null,null,null,null,null,null,null,null,null,null,null,null,null,null,null,null,null,null,{"$error":"#NAME?"},{"$error":"#NAME?"}]
[null,null,null,null,null,null,null,null,null,null,null,null,null,null,null,null,null,null,null,null,null,null,null,{"$error":"#NAME?"},{"$error":"#NAME?"}]
[null,null,null,null,null,null,null,null,null,null,null,null,null,null,null,null,null,null,null,null,null,null,null,{"$error":"#NAME?"},{"$error":"#NAME?"}]
[null,null,null,null,null,null,null,null,null,null,null,null,null,null,null,null,null,null,null,null,null,null,null,{"$error":"#NAME?"},{"$error":"#NAME?"}]
[null,null,null,null,null,null,null,null,null,null,null,null,null,null,null,null,null,null,null,null,null,null,null,{"$error":"#NAME?"},{"$error":"#NAME?"}]
[null,null,null,null,null,null,null,null,null,null,null,null,null,null,null,null,null,null,null,null,null,null,null,{"$error":"#NAME?"},{"$error":"#NAME?"}]
[null,null,null,null,null,null,null,null,null,null,null,null,null,null,null,null,null,null,null,null,null,null,null,{"$error":"#NAME?"},{"$error":"#NAME?"}]
[null,null,null,null,null,null,null,null,null,null,null,null,null,null,null,null,null,null,null,null,null,null,null,{"$error":"#NAME?"},{"$error":"#NAME?"}]
[null,null,null,null,null,null,null,null,null,null,null,null,null,null,null,null,null,null,null,null,null,null,null,{"$error":"#NAME?"},{"$error":"#NAME?"}]
[null,null,null,null,null,null,null,null,null,null,null,null,null,null,null,null,null,null,null,null,null,null,null,{"$error":"#NAME?"},{"$error":"#NAME?"}]
[null,null,null,null,null,null,null,null,null,null,null,null,null,null,null,null,null,null,null,null,null,null,null,{"$error":"#NAME?"},{"$error":"#NAME?"}]
[null,null,null,null,null,null,null,null,null,null,null,null,null,null,null,null,null,null,null,null,null,null,null,{"$error":"#NAME?"},{"$error":"#NAME?"}]
[null,null,null,null,null,null,null,null,null,null,null,null,null,null,null,null,null,null,null,null,null,null,null,{"$error":"#NAME?"},{"$error":"#NAME?"}]
[null,null,null,null,null,null,null,null,null,null,null,null,null,null,null,null,null,null,null,null,null,null,null,{"$error":"#NAME?"},{"$error":"#NAME?"}]
[null,null,null,null,null,null,null,null,null,null,null,null,null,null,null,null,null,null,null,null,null,null,null,{"$error":"#NAME?"},{"$error":"#NAME?"}]
[null,null,null,null,null,null,null,null,null,null,null,null,null,null,null,null,null,null,null,null,null,null,null,{"$error":"#NAME?"},{"$error":"#NAME?"}]
[null,null,null,null,null,null,null,null,null,null,null,null,null,null,null,null,null,null,null,null,null,null,null,{"$error":"#NAME?"},{"$error":"#NAME?"}]
[null,null,null,null,null,null,null,null,null,null,null,null,null,null,null,null,null,null,null,null,null,null,null,{"$error":"#NAME?"},{"$error":"#NAME?"}]
[null,null,null,null,null,null,null,null,null,null,null,null,null,null,null,null,null,null,null,null,null,null,null,{"$error":"#NAME?"},{"$error":"#NAME?"}]
[null,null,null,null,null,null,null,null,null,null,null,null,null,null,null,null,null,null,null,null,null,null,null,{"$error":"#NAME?"},{"$error":"#NAME?"}]
[null,null,null,null,null,null,null,null,null,null,null,null,null,null,null,null,null,null,null,null,null,null,null,{"$error":"#NAME?"},{"$error":"#NAME?"}]
[null,null,null,null,null,null,null,null,null,null,null,null,null,null,null,null,null,null,null,null,null,null,null,{"$error":"#NAME?"},{"$error":"#NAME?"}]
[null,null,null,null,null,null,null,null,null,null,null,null,null,null,null,null,null,null,null,null,null,null,null,{"$error":"#NAME?"},{"$error":"#NAME?"}]
[null,null,null,null,null,null,null,null,null,null,null,null,null,null,null,null,null,null,null,null,null,null,null,{"$error":"#NAME?"},{"$error":"#NAME?"}]
[null,null,null,null,null,null,null,null,null,null,null,null,null,null,null,null,null,null,null,null,null,null,null,{"$error":"#NAME?"},{"$error":"#NAME?"}]
[null,null,null,null,null,null,null,null,null,null,null,null,null,null,null,null,null,null,null,null,null,null,null,{"$error":"#NAME?"},{"$error":"#NAME?"}]
[null,null,null,null,null,null,null,null,null,null,null,null,null,null,null,null,null,null,null,null,null,null,null,{"$error":"#NAME?"},{"$error":"#NAME?"}]
[null,null,null,null,null,null,null,null,null,null,null,null,null,null,null,null,null,null,null,null,null,null,null,{"$error":"#NAME?"},{"$error":"#NAME?"}]
[null,null,null,null,null,null,null,null,null,null,null,null,null,null,null,null,null,null,null,null,null,null,null,{"$error":"#NAME?"},{"$error":"#NAME?"}]
[null,null,null,null,null,null,null,null,null,null,null,null,null,null,null,null,null,null,null,null,null,null,null,{"$error":"#NAME?"},{"$error":"#NAME?"}]
[null,null,null,null,null,null,null,null,null,null,null,null,null,null,null,null,null,null,null,null,null,null,null,{"$error":"#NAME?"},{"$error":"#NAME?"}]
[null,null,null,null,null,null,null,null,null,null,null,null,null,null,null,null,null,null,null,null,null,null,null,{"$error":"#NAME?"},{"$error":"#NAME?"}]
[null,null,null,null,null,null,null,null,null,null,null,null,null,null,null,null,null,null,null,null,null,null,null,{"$error":"#NAME?"},{"$error":"#NAME?"}]
[null,null,null,null,null,null,null,null,null,null,null,null,null,null,null,null,null,null,null,null,null,null,null,{"$error":"#NAME?"},{"$error":"#NAME?"}]
[null,null,null,null,null,null,null,null,null,null,null,null,null,null,null,null,null,null,null,null,null,null,null,{"$error":"#NAME?"},{"$error":"#NAME?"}]
[null,null,null,null,null,null,null,null,null,null,null,null,null,null,null,null,null,null,null,null,null,null,null,{"$error":"#NAME?"},{"$error":"#NAME?"}]
[null,null,null,null,null,null,null,null,null,null,null,null,null,null,null,null,null,null,null,null,null,null,null,{"$error":"#NAME?"},{"$error":"#NAME?"}]
[null,null,null,null,null,null,null,null,null,null,null,null,null,null,null,null,null,null,null,null,null,null,null,{"$error":"#NAME?"},{"$error":"#NAME?"}]
[null,null,null,null,null,null,null,null,null,null,null,null,null,null,null,null,null,null,null,null,null,null,null,{"$error":"#NAME?"},{"$error":"#NAME?"}]
[null,null,null,null,null,null,null,null,null,null,null,null,null,null,null,null,null,null,null,null,null,null,null,{"$error":"#NAME?"},{"$error":"#NAME?"}]
[null,null,null,null,null,null,null,null,null,null,null,null,null,null,null,null,null,null,null,null,null,null,null,{"$error":"#NAME?"},{"$error":"#NAME?"}]
[null,null,null,null,null,null,null,null,null,null,null,null,null,null,null,null,null,null,null,null,null,null,null,{"$error":"#NAME?"},{"$error":"#NAME?"}]
[null,null,null,null,null,null,null,null,null,null,null,null,null,null,null,null,null,null,null,null,null,null,null,{"$error":"#NAME?"},{"$error":"#NAME?"}]
[null,null,null,null,null,null,null,null,null,null,null,null,null,null,null,null,null,null,null,null,null,null,null,{"$error":"#NAME?"},{"$error":"#NAME?"}]
[null,null,null,null,null,null,null,null,null,null,null,null,null,null,null,null,null,null,null,null,null,null,null,{"$error":"#NAME?"},{"$error":"#NAME?"}]
[null,null,null,null,null,null,null,null,null,null,null,null,null,null,null,null,null,null,null,null,null,null,null,{"$error":"#NAME?"},{"$error":"#NAME?"}]
[null,null,null,null,null,null,null,null,null,null,null,null,null,null,null,null,null,null,null,null,null,null,null,{"$error":"#NAME?"},{"$error":"#NAME?"}]
[null,null,null,null,null,null,null,null,null,null,null,null,null,null,null,null,null,null,null,null,null,null,null,{"$error":"#NAME?"},{"$error":"#NAME?"}]
[null,null,null,null,null,null,null,null,null,null,null,null,null,null,null,null,null,null,null,null,null,null,null,{"$error":"#NAME?"},{"$error":"#NAME?"}]
[null,null,null,null,null,null,null,null,null,null,null,null,null,null,null,null,null,null,null,null,null,null,null,{"$error":"#NAME?"},{"$error":"#NAME?"}]
[null,null,null,null,null,null,null,null,null,null,null,null,null,null,null,null,null,null,null,null,null,null,null,{"$error":"#NAME?"},{"$error":"#NAME?"}]
[null,null,null,null,null,null,null,null,null,null,null,null,null,null,null,null,null,null,null,null,null,null,null,{"$error":"#NAME?"},{"$error":"#NAME?"}]
[null,null,null,null,null,null,null,null,null,null,null,null,null,null,null,null,null,null,null,null,null,null,null,{"$error":"#NAME?"},{"$error":"#NAME?"}]
[null,null,null,null,null,null,null,null,null,null,null,null,null,null,null,null,null,null,null,null,null,null,null,{"$error":"#NAME?"},{"$error":"#NAME?"}]
[null,null,null,null,null,null,null,null,null,null,null,null,null,null,null,null,null,null,null,null,null,null,null,{"$error":"#NAME?"},{"$error":"#NAME?"}]
[null,null,null,null,null,null,null,null,null,null,null,null,null,null,null,null,null,null,null,null,null,null,null,{"$error":"#NAME?"},{"$error":"#NAME?"}]
[null,null,null,null,null,null,null,null,null,null,null,null,null,null,null,null,null,null,null,null,null,null,null,{"$error":"#NAME?"},{"$error":"#NAME?"}]
[null,null,null,null,null,null,null,null,null,null,null,null,null,null,null,null,null,null,null,null,null,null,null,{"$error":"#NAME?"},{"$error":"#NAME?"}]
[null,null,null,null,null,null,null,null,null,null,null,null,null,null,null,null,null,null,null,null,null,null,null,{"$error":"#NAME?"},{"$error":"#NAME?"}]
[null,null,null,null,null,null,null,null,null,null,null,null,null,null,null,null,null,null,null,null,null,null,null,{"$error":"#NAME?"},{"$error":"#NAME?"}]
[null,null,null,null,null,null,null,null,null,null,null,null,null,null,null,null,null,null,null,null,null,null,null,{"$error":"#NAME?"},{"$error":"#NAME?"}]
[null,null,null,null,null,null,null,null,null,null,null,null,null,null,null,null,null,null,null,null,null,null,null,{"$error":"#NAME?"},{"$error":"#NAME?"}]
[null,null,null,null,null,null,null,null,null,null,null,null,null,null,null,null,null,null,null,null,null,null,null,{"$error":"#NAME?"},{"$error":"#NAME?"}]
[null,null,null,null,null,null,null,null,null,null,null,null,null,null,null,null,null,null,null,null,null,null,null,{"$error":"#NAME?"},{"$error":"#NAME?"}]
[null,null,null,null,null,null,null,null,null,null,null,null,null,null,null,null,null,null,null,null,null,null,null,{"$error":"#NAME?"},{"$error":"#NAME?"}]
[null,null,null,null,null,null,null,null,null,null,null,null,null,null,null,null,null,null,null,null,null,null,null,{"$error":"#NAME?"},{"$error":"#NAME?"}]
[null,null,null,null,null,null,null,null,null,null,null,null,null,null,null,null,null,null,null,null,null,null,null,{"$error":"#NAME?"},{"$error":"#NAME?"}]
[null,null,null,null,null,null,null,null,null,null,null,null,null,null,null,null,null,null,null,null,null,null,null,{"$error":"#NAME?"},{"$error":"#NAME?"}]
[null,null,null,null,null,null,null,null,null,null,null,null,null,null,null,null,null,null,null,null,null,null,null,{"$error":"#NAME?"},{"$error":"#NAME?"}]
[null,null,null,null,null,null,null,null,null,null,null,null,null,null,null,null,null,null,null,null,null,null,null,{"$error":"#NAME?"},{"$error":"#NAME?"}]
[null,null,null,null,null,null,null,null,null,null,null,null,null,null,null,null,null,null,null,null,null,null,null,{"$error":"#NAME?"},{"$error":"#NAME?"}]
[null,null,null,null,null,null,null,null,null,null,null,null,null,null,null,null,null,null,null,null,null,null,null,{"$error":"#NAME?"},{"$error":"#NAME?"}]
[null,null,null,null,null,null,null,null,null,null,null,null,null,null,null,null,null,null,null,null,null,null,null,{"$error":"#NAME?"},{"$error":"#NAME?"}]
[null,null,null,null,null,null,null,null,null,null,null,null,null,null,null,null,null,null,null,null,null,null,null,{"$error":"#NAME?"},{"$error":"#NAME?"}]
[null,null,null,null,null,null,null,null,null,null,null,null,null,null,null,null,null,null,null,null,null,null,null,{"$error":"#NAME?"},{"$error":"#NAME?"}]
[null,null,null,null,null,null,null,null,null,null,null,null,null,null,null,null,null,null,null,null,null,null,null,{"$error":"#NAME?"},{"$error":"#NAME?"}]
[null,null,null,null,null,null,null,null,null,null,null,null,null,null,null,null,null,null,null,null,null,null,null,{"$error":"#NAME?"},{"$error":"#NAME?"}]
[null,null,null,null,null,null,null,null,null,null,null,null,null,null,null,null,null,null,null,null,null,null,null,{"$error":"#NAME?"},{"$error":"#NAME?"}]
[null,null,null,null,null,null,null,null,null,null,null,null,null,null,null,null,null,null,null,null,null,null,null,{"$error":"#NAME?"},{"$error":"#NAME?"}]
[null,null,null,null,null,null,null,null,null,null,null,null,null,null,null,null,null,null,null,null,null,null,null,{"$error":"#NAME?"},{"$error":"#NAME?"}]
[null,null,null,null,null,null,null,null,null,null,null,null,null,null,null,null,null,null,null,null,null,null,null,{"$error":"#NAME?"},{"$error":"#NAME?"}]
[null,null,null,null,null,null,null,null,null,null,null,null,null,null,null,null,null,null,null,null,null,null,null,{"$error":"#NAME?"},{"$error":"#NAME?"}]
[null,null,null,null,null,null,null,null,null,null,null,null,null,null,null,null,null,null,null,null,null,null,null,{"$error":"#NAME?"},{"$error":"#NAME?"}]
[null,null,null,null,null,null,null,null,null,null,null,null,null,null,null,null,null,null,null,null,null,null,null,{"$error":"#NAME?"},{"$error":"#NAME?"}]
[null,null,null,null,null,null,null,null,null,null,null,null,null,null,null,null,null,null,null,null,null,null,null,{"$error":"#NAME?"},{"$error":"#NAME?"}]
[null,null,null,null,null,null,null,null,null,null,null,null,null,null,null,null,null,null,null,null,null,null,null,{"$error":"#NAME?"},{"$error":"#NAME?"}]
[null,null,null,null,null,null,null,null,null,null,null,null,null,null,null,null,null,null,null,null,null,null,null,{"$error":"#NAME?"},{"$error":"#NAME?"}]
[null,null,null,null,null,null,null,null,null,null,null,null,null,null,null,null,null,null,null,null,null,null,null,{"$error":"#NAME?"},{"$error":"#NAME?"}]
[null,null,null,null,null,null,null,null,null,null,null,null,null,null,null,null,null,null,null,null,null,null,null,{"$error":"#NAME?"},{"$error":"#NAME?"}]
[null,null,null,null,null,null,null,null,null,null,null,null,null,null,null,null,null,null,null,null,null,null,null,{"$error":"#NAME?"},{"$error":"#NAME?"}]
[null,null,null,null,null,null,null,null,null,null,null,null,null,null,null,null,null,null,null,null,null,null,null,{"$error":"#NAME?"},{"$error":"#NAME?"}]
[null,null,null,null,null,null,null,null,null,null,null,null,null,null,null,null,null,null,null,null,null,null,null,{"$error":"#NAME?"},{"$error":"#NAME?"}]
[null,null,null,null,null,null,null,null,null,null,null,null,null,null,null,null,null,null,null,null,null,null,null,{"$error":"#NAME?"},{"$error":"#NAME?"}]
[null,null,null,null,null,null,null,null,null,null,null,null,null,null,null,null,null,null,null,null,null,null,null,{"$error":"#NAME?"},{"$error":"#NAME?"}]
[null,null,null,null,null,null,null,null,null,null,null,null,null,null,null,null,null,null,null,null,null,null,null,{"$error":"#NAME?"},{"$error":"#NAME?"}]
[null,null,null,null,null,null,null,null,null,null,null,null,null,null,null,null,null,null,null,null,null,null,null,{"$error":"#NAME?"},{"$error":"#NAME?"}]
[null,null,null,null,null,null,null,null,null,null,null,null,null,null,null,null,null,null,null,null,null,null,null,{"$error":"#NAME?"},{"$error":"#NAME?"}]
[null,null,null,null,null,null,null,null,null,null,null,null,null,null,null,null,null,null,null,null,null,null,null,{"$error":"#NAME?"},{"$error":"#NAME?"}]
[null,null,null,null,null,null,null,null,null,null,null,null,null,null,null,null,null,null,null,null,null,null,null,{"$error":"#NAME?"},{"$error":"#NAME?"}]
[null,null,null,null,null,null,null,null,null,null,null,null,null,null,null,null,null,null,null,null,null,null,null,{"$error":"#NAME?"},{"$error":"#NAME?"}]
[null,null,null,null,null,null,null,null,null,null,null,null,null,null,null,null,null,null,null,null,null,null,null,{"$error":"#NAME?"},{"$error":"#NAME?"}]
[null,null,null,null,null,null,null,null,null,null,null,null,null,null,null,null,null,null,null,null,null,null,null,{"$error":"#NAME?"},{"$error":"#NAME?"}]
[null,null,null,null,null,null,null,null,null,null,null,null,null,null,null,null,null,null,null,null,null,null,null,{"$error":"#NAME?"},{"$error":"#NAME?"}]
[null,null,null,null,null,null,null,null,null,null,null,null,null,null,null,null,null,null,null,null,null,null,null,{"$error":"#NAME?"},{"$error":"#NAME?"}]
[null,null,null,null,null,null,null,null,null,null,null,null,null,null,null,null,null,null,null,null,null,null,null,{"$error":"#NAME?"},{"$error":"#NAME?"}]
[null,null,null,null,null,null,null,null,null,null,null,null,null,null,null,null,null,null,null,null,null,null,null,{"$error":"#NAME?"},{"$error":"#NAME?"}]
[null,null,null,null,null,null,null,null,null,null,null,null,null,null,null,null,null,null,null,null,null,null,null,{"$error":"#NAME?"},{"$error":"#NAME?"}]
[null,null,null,null,null,null,null,null,null,null,null,null,null,null,null,null,null,null,null,null,null,null,null,{"$error":"#NAME?"},{"$error":"#NAME?"}]
[null,null,null,null,null,null,null,null,null,null,null,null,null,null,null,null,null,null,null,null,null,null,null,{"$error":"#NAME?"},{"$error":"#NAME?"}]
[null,null,null,null,null,null,null,null,null,null,null,null,null,null,null,null,null,null,null,null,null,null,null,{"$error":"#NAME?"},{"$error":"#NAME?"}]
[null,null,null,null,null,null,null,null,null,null,null,null,null,null,null,null,null,null,null,null,null,null,null,{"$error":"#NAME?"},{"$error":"#NAME?"}]
[null,null,null,null,null,null,null,null,null,null,null,null,null,null,null,null,null,null,null,null,null,null,null,{"$error":"#NAME?"},{"$error":"#NAME?"}]
[null,null,null,null,null,null,null,null,null,null,null,null,null,null,null,null,null,null,null,null,null,null,null,{"$error":"#NAME?"},{"$error":"#NAME?"}]
[null,null,null,null,null,null,null,null,null,null,null,null,null,null,null,null,null,null,null,null,null,null,null,{"$error":"#NAME?"},{"$error":"#NAME?"}]
[null,null,null,null,null,null,null,null,null,null,null,null,null,null,null,null,null,null,null,null,null,null,null,{"$error":"#NAME?"},{"$error":"#NAME?"}]
[null,null,null,null,null,null,null,null,null,null,null,null,null,null,null,null,null,null,null,null,null,null,null,{"$error":"#NAME?"},{"$error":"#NAME?"}]
[null,null,null,null,null,null,null,null,null,null,null,null,null,null,null,null,null,null,null,null,null,null,null,{"$error":"#NAME?"},{"$error":"#NAME?"}]
[null,null,null,null,null,null,null,null,null,null,null,null,null,null,null,null,null,null,null,null,null,null,null,{"$error":"#NAME?"},{"$error":"#NAME?"}]
[null,null,null,null,null,null,null,null,null,null,null,null,null,null,null,null,null,null,null,null,null,null,null,{"$error":"#NAME?"},{"$error":"#NAME?"}]
[null,null,null,null,null,null,null,null,null,null,null,null,null,null,null,null,null,null,null,null,null,null,null,{"$error":"#NAME?"},{"$error":"#NAME?"}]
[null,null,null,null,null,null,null,null,null,null,null,null,null,null,null,null,null,null,null,null,null,null,null,{"$error":"#NAME?"},{"$error":"#NAME?"}]
[null,null,null,null,null,null,null,null,null,null,null,null,null,null,null,null,null,null,null,null,null,null,null,{"$error":"#NAME?"},{"$error":"#NAME?"}]
[null,null,null,null,null,null,null,null,null,null,null,null,null,null,null,null,null,null,null,null,null,null,null,{"$error":"#NAME?"},{"$error":"#NAME?"}]
[null,null,null,null,null,null,null,null,null,null,null,null,null,null,null,null,null,null,null,null,null,null,null,{"$error":"#NAME?"},{"$error":"#NAME?"}]
[null,null,null,null,null,null,null,null,null,null,null,null,null,null,null,null,null,null,null,null,null,null,null,{"$error":"#NAME?"},{"$error":"#NAME?"}]
[null,null,null,null,null,null,null,null,null,null,null,null,null,null,null,null,null,null,null,null,null,null,null,{"$error":"#NAME?"},{"$error":"#NAME?"}]
[null,null,null,null,null,null,null,null,null,null,null,null,null,null,null,null,null,null,null,null,null,null,null,{"$error":"#NAME?"},{"$error":"#NAME?"}]
[null,null,null,null,null,null,null,null,null,null,null,null,null,null,null,null,null,null,null,null,null,null,null,{"$error":"#NAME?"},{"$error":"#NAME?"}]
[null,null,null,null,null,null,null,null,null,null,null,null,null,null,null,null,null,null,null,null,null,null,null,{"$error":"#NAME?"},{"$error":"#NAME?"}]
[null,null,null,null,null,null,null,null,null,null,null,null,null,null,null,null,null,null,null,null,null,null,null,{"$error":"#NAME?"},{"$error":"#NAME?"}]
[null,null,null,null,null,null,null,null,null,null,null,null,null,null,null,null,null,null,null,null,null,null,null,{"$error":"#NAME?"},{"$error":"#NAME?"}]
[null,null,null,null,null,null,null,null,null,null,null,null,null,null,null,null,null,null,null,null,null,null,null,{"$error":"#NAME?"},{"$error":"#NAME?"}]
[null,null,null,null,null,null,null,null,null,null,null,null,null,null,null,null,null,null,null,null,null,null,null,{"$error":"#NAME?"},{"$error":"#NAME?"}]
[null,null,null,null,null,null,null,null,null,null,null,null,null,null,null,null,null,null,null,null,null,null,null,{"$error":"#NAME?"},{"$error":"#NAME?"}]
[null,null,null,null,null,null,null,null,null,null,null,null,null,null,null,null,null,null,null,null,null,null,null,{"$error":"#NAME?"},{"$error":"#NAME?"}]
[null,null,null,null,null,null,null,null,null,null,null,null,null,null,null,null,null,null,null,null,null,null,null,{"$error":"#NAME?"},{"$error":"#NAME?"}]
[null,null,null,null,null,null,null,null,null,null,null,null,null,null,null,null,null,null,null,null,null,null,null,{"$error":"#NAME?"},{"$error":"#NAME?"}]
[null,null,null,null,null,null,null,null,null,null,null,null,null,null,null,null,null,null,null,null,null,null,null,{"$error":"#NAME?"},{"$error":"#NAME?"}]
[null,null,null,null,null,null,null,null,null,null,null,null,null,null,null,null,null,null,null,null,null,null,null,{"$error":"#NAME?"},{"$error":"#NAME?"}]
[null,null,null,null,null,null,null,null,null,null,null,null,null,null,null,null,null,null,null,null,null,null,null,{"$error":"#NAME?"},{"$error":"#NAME?"}]
[null,null,null,null,null,null,null,null,null,null,null,null,null,null,null,null,null,null,null,null,null,null,null,{"$error":"#NAME?"},{"$error":"#NAME?"}]
[null,null,null,null,null,null,null,null,null,null,null,null,null,null,null,null,null,null,null,null,null,null,null,{"$error":"#NAME?"},{"$error":"#NAME?"}]
[null,null,null,null,null,null,null,null,null,null,null,null,null,null,null,null,null,null,null,null,null,null,null,{"$error":"#NAME?"},{"$error":"#NAME?"}]
[null,null,null,null,null,null,null,null,null,null,null,null,null,null,null,null,null,null,null,null,null,null,null,{"$error":"#NAME?"},{"$error":"#NAME?"}]
[null,null,null,null,null,null,null,null,null,null,null,null,null,null,null,null,null,null,null,null,null,null,null,{"$error":"#NAME?"},{"$error":"#NAME?"}]
[null,null,null,null,null,null,null,null,null,null,null,null,null,null,null,null,null,null,null,null,null,null,null,{"$error":"#NAME?"},{"$error":"#NAME?"}]
[null,null,null,null,null,null,null,null,null,null,null,null,null,null,null,null,null,null,null,null,null,null,null,{"$error":"#NAME?"},{"$error":"#NAME?"}]
[null,null,null,null,null,null,null,null,null,null,null,null,null,null,null,null,null,null,null,null,null,null,null,{"$error":"#NAME?"},{"$error":"#NAME?"}]
[null,null,null,null,null,null,null,null,null,null,null,null,null,null,null,null,null,null,null,null,null,null,null,{"$error":"#NAME?"},{"$error":"#NAME?"}]
[null,null,null,null,null,null,null,null,null,null,null,null,null,null,null,null,null,null,null,null,null,null,null,{"$error":"#NAME?"},{"$error":"#NAME?"}]
[null,null,null,null,null,null,null,null,null,null,null,null,null,null,null,null,null,null,null,null,null,null,null,{"$error":"#NAME?"},{"$error":"#NAME?"}]
[null,null,null,null,null,null,null,null,null,null,null,null,null,null,null,null,null,null,null,null,null,null,null,{"$error":"#NAME?"},{"$error":"#NAME?"}]
[null,null,null,null,null,null,null,null,null,null,null,null,null,null,null,null,null,null,null,null,null,null,null,{"$error":"#NAME?"},{"$error":"#NAME?"}]
[null,null,null,null,null,null,null,null,null,null,null,null,null,null,null,null,null,null,null,null,null,null,null,{"$error":"#NAME?"},{"$error":"#NAME?"}]
[null,null,null,null,null,null,null,null,null,null,null,null,null,null,null,null,null,null,null,null,null,null,null,{"$error":"#NAME?"},{"$error":"#NAME?"}]
[null,null,null,null,null,null,null,null,null,null,null,null,null,null,null,null,null,null,null,null,null,null,null,{"$error":"#NAME?"},{"$error":"#NAME?"}]
[null,null,null,null,null,null,null,null,null,null,null,null,null,null,null,null,null,null,null,null,null,null,null,{"$error":"#NAME?"},{"$error":"#NAME?"}]
[null,null,null,null,null,null,null,null,null,null,null,null,null,null,null,null,null,null,null,null,null,null,null,{"$error":"#NAME?"},{"$error":"#NAME?"}]
[null,null,null,null,null,null,null,null,null,null,null,null,null,null,null,null,null,null,null,null,null,null,null,{"$error":"#NAME?"},{"$error":"#NAME?"}]
[null,null,null,null,null,null,null,null,null,null,null,null,null,null,null,null,null,null,null,null,null,null,null,{"$error":"#NAME?"},{"$error":"#NAME?"}]
[null,null,null,null,null,null,null,null,null,null,null,null,null,null,null,null,null,null,null,null,null,null,null,{"$error":"#NAME?"},{"$error":"#NAME?"}]
[null,null,null,null,null,null,null,null,null,null,null,null,null,null,null,null,null,null,null,null,null,null,null,{"$error":"#NAME?"},{"$error":"#NAME?"}]
[null,null,null,null,null,null,null,null,null,null,null,null,null,null,null,null,null,null,null,null,null,null,null,{"$error":"#NAME?"},{"$error":"#NAME?"}]
[null,null,null,null,null,null,null,null,null,null,null,null,null,null,null,null,null,null,null,null,null,null,null,{"$error":"#NAME?"},{"$error":"#NAME?"}]
[null,null,null,null,null,null,null,null,null,null,null,null,null,null,null,null,null,null,null,null,null,null,null,{"$error":"#NAME?"},{"$error":"#NAME?"}]
[null,null,null,null,null,null,null,null,null,null,null,null,null,null,null,null,null,null,null,null,null,null,null,{"$error":"#NAME?"},{"$error":"#NAME?"}]
[null,null,null,null,null,null,null,null,null,null,null,null,null,null,null,null,null,null,null,null,null,null,null,{"$error":"#NAME?"},{"$error":"#NAME?"}]
[null,null,null,null,null,null,null,null,null,null,null,null,null,null,null,null,null,null,null,null,null,null,null,{"$error":"#NAME?"},{"$error":"#NAME?"}]
[null,null,null,null,null,null,null,null,null,null,null,null,null,null,null,null,null,null,null,null,null,null,null,{"$error":"#NAME?"},{"$error":"#NAME?"}]
[null,null,null,null,null,null,null,null,null,null,null,null,null,null,null,null,null,null,null,null,null,null,null,{"$error":"#NAME?"},{"$error":"#NAME?"}]
[null,null,null,null,null,null,null,null,null,null,null,null,null,null,null,null,null,null,null,null,null,null,null,{"$error":"#NAME?"},{"$error":"#NAME?"}]
[null,null,null,null,null,null,null,null,null,null,null,null,null,null,null,null,null,null,null,null,null,null,null,{"$error":"#NAME?"},{"$error":"#NAME?"}]
[null,null,null,null,null,null,null,null,null,null,null,null,null,null,null,null,null,null,null,null,null,null,null,{"$error":"#NAME?"},{"$error":"#NAME?"}]
[null,null,null,null,null,null,null,null,null,null,null,null,null,null,null,null,null,null,null,null,null,null,null,{"$error":"#NAME?"},{"$error":"#NAME?"}]
[null,null,null,null,null,null,null,null,null,null,null,null,null,null,null,null,null,null,null,null,null,null,null,{"$error":"#NAME?"},{"$error":"#NAME?"}]
[null,null,null,null,null,null,null,null,null,null,null,null,null,null,null,null,null,null,null,null,null,null,null,{"$error":"#NAME?"},{"$error":"#NAME?"}]
[null,null,null,null,null,null,null,null,null,null,null,null,null,null,null,null,null,null,null,null,null,null,null,{"$error":"#NAME?"},{"$error":"#NAME?"}]
[null,null,null,null,null,null,null,null,null,null,null,null,null,null,null,null,null,null,null,null,null,null,null,{"$error":"#NAME?"},{"$error":"#NAME?"}]
[null,null,null,null,null,null,null,null,null,null,null,null,null,null,null,null,null,null,null,null,null,null,null,{"$error":"#NAME?"},{"$error":"#NAME?"}]
[null,null,null,null,null,null,null,null,null,null,null,null,null,null,null,null,null,null,null,null,null,null,null,{"$error":"#NAME?"},{"$error":"#NAME?"}]
[null,null,null,null,null,null,null,null,null,null,null,null,null,null,null,null,null,null,null,null,null,null,null,{"$error":"#NAME?"},{"$error":"#NAME?"}]
[null,null,null,null,null,null,null,null,null,null,null,null,null,null,null,null,null,null,null,null,null,null,null,{"$error":"#NAME?"},{"$error":"#NAME?"}]
[null,null,null,null,null,null,null,null,null,null,null,null,null,null,null,null,null,null,null,null,null,null,null,{"$error":"#NAME?"},{"$error":"#NAME?"}]
[null,null,null,null,null,null,null,null,null,null,null,null,null,null,null,null,null,null,null,null,null,null,null,{"$error":"#NAME?"},{"$error":"#NAME?"}]
[null,null,null,null,null,null,null,null,null,null,null,null,null,null,null,null,null,null,null,null,null,null,null,{"$error":"#NAME?"},{"$error":"#NAME?"}]
[null,null,null,null,null,null,null,null,null,null,null,null,null,null,null,null,null,null,null,null,null,null,null,{"$error":"#NAME?"},{"$error":"#NAME?"}]
[null,null,null,null,null,null,null,null,null,null,null,null,null,null,null,null,null,null,null,null,null,null,null,{"$error":"#NAME?"},{"$error":"#NAME?"}]
[null,null,null,null,null,null,null,null,null,null,null,null,null,null,null,null,null,null,null,null,null,null,null,{"$error":"#NAME?"},{"$error":"#NAME?"}]
[null,null,null,null,null,null,null,null,null,null,null,null,null,null,null,null,null,null,null,null,null,null,null,{"$error":"#NAME?"},{"$error":"#NAME?"}]
[null,null,null,null,null,null,null,null,null,null,null,null,null,null,null,null,null,null,null,null,null,null,null,{"$error":"#NAME?"},{"$error":"#NAME?"}]
[null,null,null,null,null,null,null,null,null,null,null,null,null,null,null,null,null,null,null,null,null,null,null,{"$error":"#NAME?"},{"$error":"#NAME?"}]
[null,null,null,null,null,null,null,null,null,null,null,null,null,null,null,null,null,null,null,null,null,null,null,{"$error":"#NAME?"},{"$error":"#NAME?"}]
[null,null,null,null,null,null,null,null,null,null,null,null,null,null,null,null,null,null,null,null,null,null,null,{"$error":"#NAME?"},{"$error":"#NAME?"}]
[null,null,null,null,null,null,null,null,null,null,null,null,null,null,null,null,null,null,null,null,null,null,null,{"$error":"#NAME?"},{"$error":"#NAME?"}]
[null,null,null,null,null,null,null,null,null,null,null,null,null,null,null,null,null,null,null,null,null,null,null,{"$error":"#NAME?"},{"$error":"#NAME?"}]
[null,null,null,null,null,null,null,null,null,null,null,null,null,null,null,null,null,null,null,null,null,null,null,{"$error":"#NAME?"},{"$error":"#NAME?"}]
[null,null,null,null,null,null,null,null,null,null,null,null,null,null,null,null,null,null,null,null,null,null,null,{"$error":"#NAME?"},{"$error":"#NAME?"}]
[null,null,null,null,null,null,null,null,null,null,null,null,null,null,null,null,null,null,null,null,null,null,null,{"$error":"#NAME?"},{"$error":"#NAME?"}]
[null,null,null,null,null,null,null,null,null,null,null,null,null,null,null,null,null,null,null,null,null,null,null,{"$error":"#NAME?"},{"$error":"#NAME?"}]
[null,null,null,null,null,null,null,null,null,null,null,null,null,null,null,null,null,null,null,null,null,null,null,{"$error":"#NAME?"},{"$error":"#NAME?"}]
[null,null,null,null,null,null,null,null,null,null,null,null,null,null,null,null,null,null,null,null,null,null,null,{"$error":"#NAME?"},{"$error":"#NAME?"}]
[null,null,null,null,null,null,null,null,null,null,null,null,null,null,null,null,null,null,null,null,null,null,null,{"$error":"#NAME?"},{"$error":"#NAME?"}]
[null,null,null,null,null,null,null,null,null,null,null,null,null,null,null,null,null,null,null,null,null,null,null,{"$error":"#NAME?"},{"$error":"#NAME?"}]
[null,null,null,null,null,null,null,null,null,null,null,null,null,null,null,null,null,null,null,null,null,null,null,{"$error":"#NAME?"},{"$error":"#NAME?"}]
[null,null,null,null,null,null,null,null,null,null,null,null,null,null,null,null,null,null,null,null,null,null,null,{"$error":"#NAME?"},{"$error":"#NAME?"}]
[null,null,null,null,null,null,null,null,null,null,null,null,null,null,null,null,null,null,null,null,null,null,null,{"$error":"#NAME?"},{"$error":"#NAME?"}]
[null,null,null,null,null,null,null,null,null,null,null,null,null,null,null,null,null,null,null,null,null,null,null,{"$error":"#NAME?"},{"$error":"#NAME?"}]
[null,null,null,null,null,null,null,null,null,null,null,null,null,null,null,null,null,null,null,null,null,null,null,{"$error":"#NAME?"},{"$error":"#NAME?"}]
[null,null,null,null,null,null,null,null,null,null,null,null,null,null,null,null,null,null,null,null,null,null,null,{"$error":"#NAME?"},{"$error":"#NAME?"}]
[null,null,null,null,null,null,null,null,null,null,null,null,null,null,null,null,null,null,null,null,null,null,null,{"$error":"#NAME?"},{"$error":"#NAME?"}]
[null,null,null,null,null,null,null,null,null,null,null,null,null,null,null,null,null,null,null,null,null,null,null,{"$error":"#NAME?"},{"$error":"#NAME?"}]
[null,null,null,null,null,null,null,null,null,null,null,null,null,null,null,null,null,null,null,null,null,null,null,{"$error":"#NAME?"},{"$error":"#NAME?"}]
[null,null,null,null,null,null,null,null,null,null,null,null,null,null,null,null,null,null,null,null,null,null,null,{"$error":"#NAME?"},{"$error":"#NAME?"}]
[null,null,null,null,null,null,null,null,null,null,null,null,null,null,null,null,null,null,null,null,null,null,null,{"$error":"#NAME?"},{"$error":"#NAME?"}]
[null,null,null,null,null,null,null,null,null,null,null,null,null,null,null,null,null,null,null,null,null,null,null,{"$error":"#NAME?"},{"$error":"#NAME?"}]
[null,null,null,null,null,null,null,null,null,null,null,null,null,null,null,null,null,null,null,null,null,null,null,{"$error":"#NAME?"},{"$error":"#NAME?"}]
[null,null,null,null,null,null,null,null,null,null,null,null,null,null,null,null,null,null,null,null,null,null,null,{"$error":"#NAME?"},{"$error":"#NAME?"}]
[null,null,null,null,null,null,null,null,null,null,null,null,null,null,null,null,null,null,null,null,null,null,null,{"$error":"#NAME?"},{"$error":"#NAME?"}]
[null,null,null,null,null,null,null,null,null,null,null,null,null,null,null,null,null,null,null,null,null,null,null,{"$error":"#NAME?"},{"$error":"#NAME?"}]
[null,null,null,null,null,null,null,null,null,null,null,null,null,null,null,null,null,null,null,null,null,null,null,{"$error":"#NAME?"},{"$error":"#NAME?"}]
[null,null,null,null,null,null,null,null,null,null,null,null,null,null,null,null,null,null,null,null,null,null,null,{"$error":"#NAME?"},{"$error":"#NAME?"}]
[null,null,null,null,null,null,null,null,null,null,null,null,null,null,null,null,null,null,null,null,null,null,null,{"$error":"#NAME?"},{"$error":"#NAME?"}]
[null,null,null,null,null,null,null,null,null,null,null,null,null,null,null,null,null,null,null,null,null,null,null,{"$error":"#NAME?"},{"$error":"#NAME?"}]
[null,null,null,null,null,null,null,null,null,null,null,null,null,null,null,null,null,null,null,null,null,null,null,{"$error":"#NAME?"},{"$error":"#NAME?"}]
[null,null,null,null,null,null,null,null,null,null,null,null,null,null,null,null,null,null,null,null,null,null,null,{"$error":"#NAME?"},{"$error":"#NAME?"}]
[null,null,null,null,null,null,null,null,null,null,null,null,null,null,null,null,null,null,null,null,null,null,null,{"$error":"#NAME?"},{"$error":"#NAME?"}]
[null,null,null,null,null,null,null,null,null,null,null,null,null,null,null,null,null,null,null,null,null,null,null,{"$error":"#NAME?"},{"$error":"#NAME?"}]
[null,null,null,null,null,null,null,null,null,null,null,null,null,null,null,null,null,null,null,null,null,null,null,{"$error":"#NAME?"},{"$error":"#NAME?"}]
[null,null,null,null,null,null,null,null,null,null,null,null,null,null,null,null,null,null,null,null,null,null,null,{"$error":"#NAME?"},{"$error":"#NAME?"}]
[null,null,null,null,null,null,null,null,null,null,null,null,null,null,null,null,null,null,null,null,null,null,null,{"$error":"#NAME?"},{"$error":"#NAME?"}]
[null,null,null,null,null,null,null,null,null,null,null,null,null,null,null,null,null,null,null,null,null,null,null,{"$error":"#NAME?"},{"$error":"#NAME?"}]
[null,null,null,null,null,null,null,null,null,null,null,null,null,null,null,null,null,null,null,null,null,null,null,{"$error":"#NAME?"},{"$error":"#NAME?"}]
[null,null,null,null,null,null,null,null,null,null,null,null,null,null,null,null,null,null,null,null,null,null,null,{"$error":"#NAME?"},{"$error":"#NAME?"}]
[null,null,null,null,null,null,null,null,null,null,null,null,null,null,null,null,null,null,null,null,null,null,null,{"$error":"#NAME?"},{"$error":"#NAME?"}]
[null,null,null,null,null,null,null,null,null,null,null,null,null,null,null,null,null,null,null,null,null,null,null,{"$error":"#NAME?"},{"$error":"#NAME?"}]
[null,null,null,null,null,null,null,null,null,null,null,null,null,null,null,null,null,null,null,null,null,null,null,{"$error":"#NAME?"},{"$error":"#NAME?"}]
[null,null,null,null,null,null,null,null,null,null,null,null,null,null,null,null,null,null,null,null,null,null,null,{"$error":"#NAME?"},{"$error":"#NAME?"}]
[null,null,null,null,null,null,null,null,null,null,null,null,null,null,null,null,null,null,null,null,null,null,null,{"$error":"#NAME?"},{"$error":"#NAME?"}]
[null,null,null,null,null,null,null,null,null,null,null,null,null,null,null,null,null,null,null,null,null,null,null,{"$error":"#NAME?"},{"$error":"#NAME?"}]
[null,null,null,null,null,null,null,null,null,null,null,null,null,null,null,null,null,null,null,null,null,null,null,{"$error":"#NAME?"},{"$error":"#NAME?"}]
[null,null,null,null,null,null,null,null,null,null,null,null,null,null,null,null,null,null,null,null,null,null,null,{"$error":"#NAME?"},{"$error":"#NAME?"}]
[null,null,null,null,null,null,null,null,null,null,null,null,null,null,null,null,null,null,null,null,null,null,null,{"$error":"#NAME?"},{"$error":"#NAME?"}]
[null,null,null,null,null,null,null,null,null,null,null,null,null,null,null,null,null,null,null,null,null,null,null,{"$error":"#NAME?"},{"$error":"#NAME?"}]
[null,null,null,null,null,null,null,null,null,null,null,null,null,null,null,null,null,null,null,null,null,null,null,{"$error":"#NAME?"},{"$error":"#NAME?"}]
[null,null,null,null,null,null,null,null,null,null,null,null,null,null,null,null,null,null,null,null,null,null,null,{"$error":"#NAME?"},{"$error":"#NAME?"}]
[null,null,null,null,null,null,null,null,null,null,null,null,null,null,null,null,null,null,null,null,null,null,null,{"$error":"#NAME?"},{"$error":"#NAME?"}]
[null,null,null,null,null,null,null,null,null,null,null,null,null,null,null,null,null,null,null,null,null,null,null,{"$error":"#NAME?"},{"$error":"#NAME?"}]
[null,null,null,null,null,null,null,null,null,null,null,null,null,null,null,null,null,null,null,null,null,null,null,{"$error":"#NAME?"},{"$error":"#NAME?"}]
[null,null,null,null,null,null,null,null,null,null,null,null,null,null,null,null,null,null,null,null,null,null,null,{"$error":"#NAME?"},{"$error":"#NAME?"}]
[null,null,null,null,null,null,null,null,null,null,null,null,null,null,null,null,null,null,null,null,null,null,null,{"$error":"#NAME?"},{"$error":"#NAME?"}]
[null,null,null,null,null,null,null,null,null,null,null,null,null,null,null,null,null,null,null,null,null,null,null,{"$error":"#NAME?"},{"$error":"#NAME?"}]
[null,null,null,null,null,null,null,null,null,null,null,null,null,null,null,null,null,null,null,null,null,null,null,{"$error":"#NAME?"},{"$error":"#NAME?"}]
[null,null,null,null,null,null,null,null,null,null,null,null,null,null,null,null,null,null,null,null,null,null,null,{"$error":"#NAME?"},{"$error":"#NAME?"}]
[null,null,null,null,null,null,null,null,null,null,null,null,null,null,null,null,null,null,null,null,null,null,null,{"$error":"#NAME?"},{"$error":"#NAME?"}]
[null,null,null,null,null,null,null,null,null,null,null,null,null,null,null,null,null,null,null,null,null,null,null,{"$error":"#NAME?"},{"$error":"#NAME?"}]
[null,null,null,null,null,null,null,null,null,null,null,null,null,null,null,null,null,null,null,null,null,null,null,{"$error":"#NAME?"},{"$error":"#NAME?"}]
[null,null,null,null,null,null,null,null,null,null,null,null,null,null,null,null,null,null,null,null,null,null,null,{"$error":"#NAME?"},{"$error":"#NAME?"}]
[null,null,null,null,null,null,null,null,null,null,null,null,null,null,null,null,null,null,null,null,null,null,null,{"$error":"#NAME?"},{"$error":"#NAME?"}]
[null,null,null,null,null,null,null,null,null,null,null,null,null,null,null,null,null,null,null,null,null,null,null,{"$error":"#NAME?"},{"$error":"#NAME?"}]
[null,null,null,null,null,null,null,null,null,null,null,null,null,null,null,null,null,null,null,null,null,null,null,{"$error":"#NAME?"},{"$error":"#NAME?"}]
[null,null,null,null,null,null,null,null,null,null,null,null,null,null,null,null,null,null,null,null,null,null,null,{"$error":"#NAME?"},{"$error":"#NAME?"}]
[null,null,null,null,null,null,null,null,null,null,null,null,null,null,null,null,null,null,null,null,null,null,null,{"$error":"#NAME?"},{"$error":"#NAME?"}]
[null,null,null,null,null,null,null,null,null,null,null,null,null,null,null,null,null,null,null,null,null,null,null,{"$error":"#NAME?"},{"$error":"#NAME?"}]
[null,null,null,null,null,null,null,null,null,null,null,null,null,null,null,null,null,null,null,null,null,null,null,{"$error":"#NAME?"},{"$error":"#NAME?"}]
[null,null,null,null,null,null,null,null,null,null,null,null,null,null,null,null,null,null,null,null,null,null,null,{"$error":"#NAME?"},{"$error":"#NAME?"}]
[null,null,null,null,null,null,null,null,null,null,null,null,null,null,null,null,null,null,null,null,null,null,null,{"$error":"#NAME?"},{"$error":"#NAME?"}]
[null,null,null,null,null,null,null,null,null,null,null,null,null,null,null,null,null,null,null,null,null,null,null,{"$error":"#NAME?"},{"$error":"#NAME?"}]
[null,null,null,null,null,null,null,null,null,null,null,null,null,null,null,null,null,null,null,null,null,null,null,{"$error":"#NAME?"},{"$error":"#NAME?"}]
[null,null,null,null,null,null,null,null,null,null,null,null,null,null,null,null,null,null,null,null,null,null,null,{"$error":"#NAME?"},{"$error":"#NAME?"}]
[null,null,null,null,null,null,null,null,null,null,null,null,null,null,null,null,null,null,null,null,null,null,null,{"$error":"#NAME?"},{"$error":"#NAME?"}]
[null,null,null,null,null,null,null,null,null,null,null,null,null,null,null,null,null,null,null,null,null,null,null,{"$error":"#NAME?"},{"$error":"#NAME?"}]
[null,null,null,null,null,null,null,null,null,null,null,null,null,null,null,null,null,null,null,null,null,null,null,{"$error":"#NAME?"},{"$error":"#NAME?"}]
[null,null,null,null,null,null,null,null,null,null,null,null,null,null,null,null,null,null,null,null,null,null,null,{"$error":"#NAME?"},{"$error":"#NAME?"}]
[null,null,null,null,null,null,null,null,null,null,null,null,null,null,null,null,null,null,null,null,null,null,null,{"$error":"#NAME?"},{"$error":"#NAME?"}]
[null,null,null,null,null,null,null,null,null,null,null,null,null,null,null,null,null,null,null,null,null,null,null,{"$error":"#NAME?"},{"$error":"#NAME?"}]
[null,null,null,null,null,null,null,null,null,null,null,null,null,null,null,null,null,null,null,null,null,null,null,{"$error":"#NAME?"},{"$error":"#NAME?"}]
[null,null,null,null,null,null,null,null,null,null,null,null,null,null,null,null,null,null,null,null,null,null,null,{"$error":"#NAME?"},{"$error":"#NAME?"}]
[null,null,null,null,null,null,null,null,null,null,null,null,null,null,null,null,null,null,null,null,null,null,null,{"$error":"#NAME?"},{"$error":"#NAME?"}]
[null,null,null,null,null,null,null,null,null,null,null,null,null,null,null,null,null,null,null,null,null,null,null,{"$error":"#NAME?"},{"$error":"#NAME?"}]
[null,null,null,null,null,null,null,null,null,null,null,null,null,null,null,null,null,null,null,null,null,null,null,{"$error":"#NAME?"},{"$error":"#NAME?"}]
[null,null,null,null,null,null,null,null,null,null,null,null,null,null,null,null,null,null,null,null,null,null,null,{"$error":"#NAME?"},{"$error":"#NAME?"}]
[null,null,null,null,null,null,null,null,null,null,null,null,null,null,null,null,null,null,null,null,null,null,null,{"$error":"#NAME?"},{"$error":"#NAME?"}]
[null,null,null,null,null,null,null,null,null,null,null,null,null,null,null,null,null,null,null,null,null,null,null,{"$error":"#NAME?"},{"$error":"#NAME?"}]
[null,null,null,null,null,null,null,null,null,null,null,null,null,null,null,null,null,null,null,null,null,null,null,{"$error":"#NAME?"},{"$error":"#NAME?"}]
[null,null,null,null,null,null,null,null,null,null,null,null,null,null,null,null,null,null,null,null,null,null,null,{"$error":"#NAME?"},{"$error":"#NAME?"}]
[null,null,null,null,null,null,null,null,null,null,null,null,null,null,null,null,null,null,null,null,null,null,null,{"$error":"#NAME?"},{"$error":"#NAME?"}]
[null,null,null,null,null,null,null,null,null,null,null,null,null,null,null,null,null,null,null,null,null,null,null,{"$error":"#NAME?"},{"$error":"#NAME?"}]
[null,null,null,null,null,null,null,null,null,null,null,null,null,null,null,null,null,null,null,null,null,null,null,{"$error":"#NAME?"},{"$error":"#NAME?"}]
[null,null,null,null,null,null,null,null,null,null,null,null,null,null,null,null,null,null,null,null,null,null,null,{"$error":"#NAME?"},{"$error":"#NAME?"}]
[null,null,null,null,null,null,null,null,null,null,null,null,null,null,null,null,null,null,null,null,null,null,null,{"$error":"#NAME?"},{"$error":"#NAME?"}]
[null,null,null,null,null,null,null,null,null,null,null,null,null,null,null,null,null,null,null,null,null,null,null,{"$error":"#NAME?"},{"$error":"#NAME?"}]
[null,null,null,null,null,null,null,null,null,null,null,null,null,null,null,null,null,null,null,null,null,null,null,{"$error":"#NAME?"},{"$error":"#NAME?"}]
[null,null,null,null,null,null,null,null,null,null,null,null,null,null,null,null,null,null,null,null,null,null,null,{"$error":"#NAME?"},{"$error":"#NAME?"}]
[null,null,null,null,null,null,null,null,null,null,null,null,null,null,null,null,null,null,null,null,null,null,null,{"$error":"#NAME?"},{"$error":"#NAME?"}]
[null,null,null,null,null,null,null,null,null,null,null,null,null,null,null,null,null,null,null,null,null,null,null,{"$error":"#NAME?"},{"$error":"#NAME?"}]
[null,null,null,null,null,null,null,null,null,null,null,null,null,null,null,null,null,null,null,null,null,null,null,{"$error":"#NAME?"},{"$error":"#NAME?"}]
[null,null,null,null,null,null,null,null,null,null,null,null,null,null,null,null,null,null,null,null,null,null,null,{"$error":"#NAME?"},{"$error":"#NAME?"}]
[null,null,null,null,null,null,null,null,null,null,null,null,null,null,null,null,null,null,null,null,null,null,null,{"$error":"#NAME?"},{"$error":"#NAME?"}]
[null,null,null,null,null,null,null,null,null,null,null,null,null,null,null,null,null,null,null,null,null,null,null,{"$error":"#NAME?"},{"$error":"#NAME?"}]
[null,null,null,null,null,null,null,null,null,null,null,null,null,null,null,null,null,null,null,null,null,null,null,{"$error":"#NAME?"},{"$error":"#NAME?"}]
[null,null,null,null,null,null,null,null,null,null,null,null,null,null,null,null,null,null,null,null,null,null,null,{"$error":"#NAME?"},{"$error":"#NAME?"}]
[null,null,null,null,null,null,null,null,null,null,null,null,null,null,null,null,null,null,null,null,null,null,null,{"$error":"#NAME?"},{"$error":"#NAME?"}]
[null,null,null,null,null,null,null,null,null,null,null,null,null,null,null,null,null,null,null,null,null,null,null,{"$error":"#NAME?"},{"$error":"#NAME?"}]
[null,null,null,null,null,null,null,null,null,null,null,null,null,null,null,null,null,null,null,null,null,null,null,{"$error":"#NAME?"},{"$error":"#NAME?"}]
[null,null,null,null,null,null,null,null,null,null,null,null,null,null,null,null,null,null,null,null,null,null,null,{"$error":"#NAME?"},{"$error":"#NAME?"}]
[null,null,null,null,null,null,null,null,null,null,null,null,null,null,null,null,null,null,null,null,null,null,null,{"$error":"#NAME?"},{"$error":"#NAME?"}]
[null,null,null,null,null,null,null,null,null,null,null,null,null,null,null,null,null,null,null,null,null,null,null,{"$error":"#NAME?"},{"$error":"#NAME?"}]
[null,null,null,null,null,null,null,null,null,null,null,null,null,null,null,null,null,null,null,null,null,null,null,{"$error":"#NAME?"},{"$error":"#NAME?"}]
[null,null,null,null,null,null,null,null,null,null,null,null,null,null,null,null,null,null,null,null,null,null,null,{"$error":"#NAME?"},{"$error":"#NAME?"}]
[null,null,null,null,null,null,null,null,null,null,null,null,null,null,null,null,null,null,null,null,null,null,null,{"$error":"#NAME?"},{"$error":"#NAME?"}]
[null,null,null,null,null,null,null,null,null,null,null,null,null,null,null,null,null,null,null,null,null,null,null,{"$error":"#NAME?"},{"$error":"#NAME?"}]
[null,null,null,null,null,null,null,null,null,null,null,null,null,null,null,null,null,null,null,null,null,null,null,{"$error":"#NAME?"},{"$error":"#NAME?"}]
[null,null,null,null,null,null,null,null,null,null,null,null,null,null,null,null,null,null,null,null,null,null,null,{"$error":"#NAME?"},{"$error":"#NAME?"}]
[null,null,null,null,null,null,null,null,null,null,null,null,null,null,null,null,null,null,null,null,null,null,null,{"$error":"#NAME?"},{"$error":"#NAME?"}]
[null,null,null,null,null,null,null,null,null,null,null,null,null,null,null,null,null,null,null,null,null,null,null,{"$error":"#NAME?"},{"$error":"#NAME?"}]
[null,null,null,null,null,null,null,null,null,null,null,null,null,null,null,null,null,null,null,null,null,null,null,{"$error":"#NAME?"},{"$error":"#NAME?"}]
[null,null,null,null,null,null,null,null,null,null,null,null,null,null,null,null,null,null,null,null,null,null,null,{"$error":"#NAME?"},{"$error":"#NAME?"}]
[null,null,null,null,null,null,null,null,null,null,null,null,null,null,null,null,null,null,null,null,null,null,null,{"$error":"#NAME?"},{"$error":"#NAME?"}]
[null,null,null,null,null,null,null,null,null,null,null,null,null,null,null,null,null,null,null,null,null,null,null,{"$error":"#NAME?"},{"$error":"#NAME?"}]
[null,null,null,null,null,null,null,null,null,null,null,null,null,null,null,null,null,null,null,null,null,null,null,{"$error":"#NAME?"},{"$error":"#NAME?"}]
[null,null,null,null,null,null,null,null,null,null,null,null,null,null,null,null,null,null,null,null,null,null,null,{"$error":"#NAME?"},{"$error":"#NAME?"}]
[null,null,null,null,null,null,null,null,null,null,null,null,null,null,null,null,null,null,null,null,null,null,null,{"$error":"#NAME?"},{"$error":"#NAME?"}]
[null,null,null,null,null,null,null,null,null,null,null,null,null,null,null,null,null,null,null,null,null,null,null,{"$error":"#NAME?"},{"$error":"#NAME?"}]
[null,null,null,null,null,null,null,null,null,null,null,null,null,null,null,null,null,null,null,null,null,null,null,{"$error":"#NAME?"},{"$error":"#NAME?"}]
[null,null,null,null,null,null,null,null,null,null,null,null,null,null,null,null,null,null,null,null,null,null,null,{"$error":"#NAME?"},{"$error":"#NAME?"}]
[null,null,null,null,null,null,null,null,null,null,null,null,null,null,null,null,null,null,null,null,null,null,null,{"$error":"#NAME?"},{"$error":"#NAME?"}]
[null,null,null,null,null,null,null,null,null,null,null,null,null,null,null,null,null,null,null,null,null,null,null,{"$error":"#NAME?"},{"$error":"#NAME?"}]
[null,null,null,null,null,null,null,null,null,null,null,null,null,null,null,null,null,null,null,null,null,null,null,{"$error":"#NAME?"},{"$error":"#NAME?"}]
[null,null,null,null,null,null,null,null,null,null,null,null,null,null,null,null,null,null,null,null,null,null,null,{"$error":"#NAME?"},{"$error":"#NAME?"}]
[null,null,null,null,null,null,null,null,null,null,null,null,null,null,null,null,null,null,null,null,null,null,null,{"$error":"#NAME?"},{"$error":"#NAME?"}]
[null,null,null,null,null,null,null,null,null,null,null,null,null,null,null,null,null,null,null,null,null,null,null,{"$error":"#NAME?"},{"$error":"#NAME?"}]
[null,null,null,null,null,null,null,null,null,null,null,null,null,null,null,null,null,null,null,null,null,null,null,{"$error":"#NAME?"},{"$error":"#NAME?"}]
[null,null,null,null,null,null,null,null,null,null,null,null,null,null,null,null,null,null,null,null,null,null,null,{"$error":"#NAME?"},{"$error":"#NAME?"}]
[null,null,null,null,null,null,null,null,null,null,null,null,null,null,null,null,null,null,null,null,null,null,null,{"$error":"#NAME?"},{"$error":"#NAME?"}]
[null,null,null,null,null,null,null,null,null,null,null,null,null,null,null,null,null,null,null,null,null,null,null,{"$error":"#NAME?"},{"$error":"#NAME?"}]
[null,null,null,null,null,null,null,null,null,null,null,null,null,null,null,null,null,null,null,null,null,null,null,{"$error":"#NAME?"},{"$error":"#NAME?"}]
[null,null,null,null,null,null,null,null,null,null,null,null,null,null,null,null,null,null,null,null,null,null,null,{"$error":"#NAME?"},{"$error":"#NAME?"}]
[null,null,null,null,null,null,null,null,null,null,null,null,null,null,null,null,null,null,null,null,null,null,null,{"$error":"#NAME?"},{"$error":"#NAME?"}]
[null,null,null,null,null,null,null,null,null,null,null,null,null,null,null,null,null,null,null,null,null,null,null,{"$error":"#NAME?"},{"$error":"#NAME?"}]
[null,null,null,null,null,null,null,null,null,null,null,null,null,null,null,null,null,null,null,null,null,null,null,{"$error":"#NAME?"},{"$error":"#NAME?"}]
[null,null,null,null,null,null,null,null,null,null,null,null,null,null,null,null,null,null,null,null,null,null,null,{"$error":"#NAME?"},{"$error":"#NAME?"}]
[null,null,null,null,null,null,null,null,null,null,null,null,null,null,null,null,null,null,null,null,null,null,null,{"$error":"#NAME?"},{"$error":"#NAME?"}]
[null,null,null,null,null,null,null,null,null,null,null,null,null,null,null,null,null,null,null,null,null,null,null,{"$error":"#NAME?"},{"$error":"#NAME?"}]
[null,null,null,null,null,null,null,null,null,null,null,null,null,null,null,null,null,null,null,null,null,null,null,{"$error":"#NAME?"},{"$error":"#NAME?"}]
[null,null,null,null,null,null,null,null,null,null,null,null,null,null,null,null,null,null,null,null,null,null,null,{"$error":"#NAME?"},{"$error":"#NAME?"}]
[null,null,null,null,null,null,null,null,null,null,null,null,null,null,null,null,null,null,null,null,null,null,null,{"$error":"#NAME?"},{"$error":"#NAME?"}]
[null,null,null,null,null,null,null,null,null,null,null,null,null,null,null,null,null,null,null,null,null,null,null,{"$error":"#NAME?"},{"$error":"#NAME?"}]
[null,null,null,null,null,null,null,null,null,null,null,null,null,null,null,null,null,null,null,null,null,null,null,{"$error":"#NAME?"},{"$error":"#NAME?"}]
[null,null,null,null,null,null,null,null,null,null,null,null,null,null,null,null,null,null,null,null,null,null,null,{"$error":"#NAME?"},{"$error":"#NAME?"}]
[null,null,null,null,null,null,null,null,null,null,null,null,null,null,null,null,null,null,null,null,null,null,null,{"$error":"#NAME?"},{"$error":"#NAME?"}]
[null,null,null,null,null,null,null,null,null,null,null,null,null,null,null,null,null,null,null,null,null,null,null,{"$error":"#NAME?"},{"$error":"#NAME?"}]
[null,null,null,null,null,null,null,null,null,null,null,null,null,null,null,null,null,null,null,null,null,null,null,{"$error":"#NAME?"},{"$error":"#NAME?"}]
[null,null,null,null,null,null,null,null,null,null,null,null,null,null,null,null,null,null,null,null,null,null,null,{"$error":"#NAME?"},{"$error":"#NAME?"}]
[null,null,null,null,null,null,null,null,null,null,null,null,null,null,null,null,null,null,null,null,null,null,null,{"$error":"#NAME?"},{"$error":"#NAME?"}]
[null,null,null,null,null,null,null,null,null,null,null,null,null,null,null,null,null,null,null,null,null,null,null,{"$error":"#NAME?"},{"$error":"#NAME?"}]
[null,null,null,null,null,null,null,null,null,null,null,null,null,null,null,null,null,null,null,null,null,null,null,{"$error":"#NAME?"},{"$error":"#NAME?"}]
[null,null,null,null,null,null,null,null,null,null,null,null,null,null,null,null,null,null,null,null,null,null,null,{"$error":"#NAME?"},{"$error":"#NAME?"}]
[null,null,null,null,null,null,null,null,null,null,null,null,null,null,null,null,null,null,null,null,null,null,null,{"$error":"#NAME?"},{"$error":"#NAME?"}]
[null,null,null,null,null,null,null,null,null,null,null,null,null,null,null,null,null,null,null,null,null,null,null,{"$error":"#NAME?"},{"$error":"#NAME?"}]
[null,null,null,null,null,null,null,null,null,null,null,null,null,null,null,null,null,null,null,null,null,null,null,{"$error":"#NAME?"},{"$error":"#NAME?"}]
[null,null,null,null,null,null,null,null,null,null,null,null,null,null,null,null,null,null,null,null,null,null,null,{"$error":"#NAME?"},{"$error":"#NAME?"}]
[null,null,null,null,null,null,null,null,null,null,null,null,null,null,null,null,null,null,null,null,null,null,null,{"$error":"#NAME?"},{"$error":"#NAME?"}]
[null,null,null,null,null,null,null,null,null,null,null,null,null,null,null,null,null,null,null,null,null,null,null,{"$error":"#NAME?"},{"$error":"#NAME?"}]
[null,null,null,null,null,null,null,null,null,null,null,null,null,null,null,null,null,null,null,null,null,null,null,{"$error":"#NAME?"},{"$error":"#NAME?"}]
[null,null,null,null,null,null,null,null,null,null,null,null,null,null,null,null,null,null,null,null,null,null,null,{"$error":"#NAME?"},{"$error":"#NAME?"}]
[null,null,null,null,null,null,null,null,null,null,null,null,null,null,null,null,null,null,null,null,null,null,null,{"$error":"#NAME?"},{"$error":"#NAME?"}]
[null,null,null,null,null,null,null,null,null,null,null,null,null,null,null,null,null,null,null,null,null,null,null,{"$error":"#NAME?"},{"$error":"#NAME?"}]
[null,null,null,null,null,null,null,null,null,null,null,null,null,null,null,null,null,null,null,null,null,null,null,{"$error":"#NAME?"},{"$error":"#NAME?"}]
[null,null,null,null,null,null,null,null,null,null,null,null,null,null,null,null,null,null,null,null,null,null,null,{"$error":"#NAME?"},{"$error":"#NAME?"}]
[null,null,null,null,null,null,null,null,null,null,null,null,null,null,null,null,null,null,null,null,null,null,null,{"$error":"#NAME?"},{"$error":"#NAME?"}]
[null,null,null,null,null,null,null,null,null,null,null,null,null,null,null,null,null,null,null,null,null,null,null,{"$error":"#NAME?"},{"$error":"#NAME?"}]
[null,null,null,null,null,null,null,null,null,null,null,null,null,null,null,null,null,null,null,null,null,null,null,{"$error":"#NAME?"},{"$error":"#NAME?"}]
[null,null,null,null,null,null,null,null,null,null,null,null,null,null,null,null,null,null,null,null,null,null,null,{"$error":"#NAME?"},{"$error":"#NAME?"}]
[null,null,null,null,null,null,null,null,null,null,null,null,null,null,null,null,null,null,null,null,null,null,null,{"$error":"#NAME?"},{"$error":"#NAME?"}]
[null,null,null,null,null,null,null,null,null,null,null,null,null,null,null,null,null,null,null,null,null,null,null,{"$error":"#NAME?"},{"$error":"#NAME?"}]
[null,null,null,null,null,null,null,null,null,null,null,null,null,null,null,null,null,null,null,null,null,null,null,{"$error":"#NAME?"},{"$error":"#NAME?"}]
[null,null,null,null,null,null,null,null,null,null,null,null,null,null,null,null,null,null,null,null,null,null,null,{"$error":"#NAME?"},{"$error":"#NAME?"}]
[null,null,null,null,null,null,null,null,null,null,null,null,null,null,null,null,null,null,null,null,null,null,null,{"$error":"#NAME?"},{"$error":"#NAME?"}]
[null,null,null,null,null,null,null,null,null,null,null,null,null,null,null,null,null,null,null,null,null,null,null,{"$error":"#NAME?"},{"$error":"#NAME?"}]
[null,null,null,null,null,null,null,null,null,null,null,null,null,null,null,null,null,null,null,null,null,null,null,{"$error":"#NAME?"},{"$error":"#NAME?"}]
[null,null,null,null,null,null,null,null,null,null,null,null,null,null,null,null,null,null,null,null,null,null,null,{"$error":"#NAME?"},{"$error":"#NAME?"}]
[null,null,null,null,null,null,null,null,null,null,null,null,null,null,null,null,null,null,null,null,null,null,null,{"$error":"#NAME?"},{"$error":"#NAME?"}]
[null,null,null,null,null,null,null,null,null,null,null,null,null,null,null,null,null,null,null,null,null,null,null,{"$error":"#NAME?"},{"$error":"#NAME?"}]
[null,null,null,null,null,null,null,null,null,null,null,null,null,null,null,null,null,null,null,null,null,null,null,{"$error":"#NAME?"},{"$error":"#NAME?"}]
[null,null,null,null,null,null,null,null,null,null,null,null,null,null,null,null,null,null,null,null,null,null,null,{"$error":"#NAME?"},{"$error":"#NAME?"}]
[null,null,null,null,null,null,null,null,null,null,null,null,null,null,null,null,null,null,null,null,null,null,null,{"$error":"#NAME?"},{"$error":"#NAME?"}]
[null,null,null,null,null,null,null,null,null,null,null,null,null,null,null,null,null,null,null,null,null,null,null,{"$error":"#NAME?"},{"$error":"#NAME?"}]
[null,null,null,null,null,null,null,null,null,null,null,null,null,null,null,null,null,null,null,null,null,null,null,{"$error":"#NAME?"},{"$error":"#NAME?"}]
[null,null,null,null,null,null,null,null,null,null,null,null,null,null,null,null,null,null,null,null,null,null,null,{"$error":"#NAME?"},{"$error":"#NAME?"}]
[null,null,null,null,null,null,null,null,null,null,null,null,null,null,null,null,null,null,null,null,null,null,null,{"$error":"#NAME?"},{"$error":"#NAME?"}]
[null,null,null,null,null,null,null,null,null,null,null,null,null,null,null,null,null,null,null,null,null,null,null,{"$error":"#NAME?"},{"$error":"#NAME?"}]
[null,null,null,null,null,null,null,null,null,null,null,null,null,null,null,null,null,null,null,null,null,null,null,{"$error":"#NAME?"},{"$error":"#NAME?"}]
[null,null,null,null,null,null,null,null,null,null,null,null,null,null,null,null,null,null,null,null,null,null,null,{"$error":"#NAME?"},{"$error":"#NAME?"}]
[null,null,null,null,null,null,null,null,null,null,null,null,null,null,null,null,null,null,null,null,null,null,null,{"$error":"#NAME?"},{"$error":"#NAME?"}]
[null,null,null,null,null,null,null,null,null,null,null,null,null,null,null,null,null,null,null,null,null,null,null,{"$error":"#NAME?"},{"$error":"#NAME?"}]
[null,null,null,null,null,null,null,null,null,null,null,null,null,null,null,null,null,null,null,null,null,null,null,{"$error":"#NAME?"},{"$error":"#NAME?"}]
[null,null,null,null,null,null,null,null,null,null,null,null,null,null,null,null,null,null,null,null,null,null,null,{"$error":"#NAME?"},{"$error":"#NAME?"}]
[null,null,null,null,null,null,null,null,null,null,null,null,null,null,null,null,null,null,null,null,null,null,null,{"$error":"#NAME?"},{"$error":"#NAME?"}]
[null,null,null,null,null,null,null,null,null,null,null,null,null,null,null,null,null,null,null,null,null,null,null,{"$error":"#NAME?"},{"$error":"#NAME?"}]
[null,null,null,null,null,null,null,null,null,null,null,null,null,null,null,null,null,null,null,null,null,null,null,{"$error":"#NAME?"},{"$error":"#NAME?"}]
[null,null,null,null,null,null,null,null,null,null,null,null,null,null,null,null,null,null,null,null,null,null,null,{"$error":"#NAME?"},{"$error":"#NAME?"}]
[null,null,null,null,null,null,null,null,null,null,null,null,null,null,null,null,null,null,null,null,null,null,null,{"$error":"#NAME?"},{"$error":"#NAME?"}]
[null,null,null,null,null,null,null,null,null,null,null,null,null,null,null,null,null,null,null,null,null,null,null,{"$error":"#NAME?"},{"$error":"#NAME?"}]
[null,null,null,null,null,null,null,null,null,null,null,null,null,null,null,null,null,null,null,null,null,null,null,{"$error":"#NAME?"},{"$error":"#NAME?"}]
[null,null,null,null,null,null,null,null,null,null,null,null,null,null,null,null,null,null,null,null,null,null,null,{"$error":"#NAME?"},{"$error":"#NAME?"}]
[null,null,null,null,null,null,null,null,null,null,null,null,null,null,null,null,null,null,null,null,null,null,null,{"$error":"#NAME?"},{"$error":"#NAME?"}]
[null,null,null,null,null,null,null,null,null,null,null,null,null,null,null,null,null,null,null,null,null,null,null,{"$error":"#NAME?"},{"$error":"#NAME?"}]
[null,null,null,null,null,null,null,null,null,null,null,null,null,null,null,null,null,null,null,null,null,null,null,{"$error":"#NAME?"},{"$error":"#NAME?"}]
[null,null,null,null,null,null,null,null,null,null,null,null,null,null,null,null,null,null,null,null,null,null,null,{"$error":"#NAME?"},{"$error":"#NAME?"}]
[null,null,null,null,null,null,null,null,null,null,null,null,null,null,null,null,null,null,null,null,null,null,null,{"$error":"#NAME?"},{"$error":"#NAME?"}]
[null,null,null,null,null,null,null,null,null,null,null,null,null,null,null,null,null,null,null,null,null,null,null,{"$error":"#NAME?"},{"$error":"#NAME?"}]
[null,null,null,null,null,null,null,null,null,null,null,null,null,null,null,null,null,null,null,null,null,null,null,{"$error":"#NAME?"},{"$error":"#NAME?"}]
[null,null,null,null,null,null,null,null,null,null,null,null,null,null,null,null,null,null,null,null,null,null,null,{"$error":"#NAME?"},{"$error":"#NAME?"}]
[null,null,null,null,null,null,null,null,null,null,null,null,null,null,null,null,null,null,null,null,null,null,null,{"$error":"#NAME?"},{"$error":"#NAME?"}]
[null,null,null,null,null,null,null,null,null,null,null,null,null,null,null,null,null,null,null,null,null,null,null,{"$error":"#NAME?"},{"$error":"#NAME?"}]
[null,null,null,null,null,null,null,null,null,null,null,null,null,null,null,null,null,null,null,null,null,null,null,{"$error":"#NAME?"},{"$error":"#NAME?"}]
[null,null,null,null,null,null,null,null,null,null,null,null,null,null,null,null,null,null,null,null,null,null,null,{"$error":"#NAME?"},{"$error":"#NAME?"}]
[null,null,null,null,null,null,null,null,null,null,null,null,null,null,null,null,null,null,null,null,null,null,null,{"$error":"#NAME?"},{"$error":"#NAME?"}]
[null,null,null,null,null,null,null,null,null,null,null,null,null,null,null,null,null,null,null,null,null,null,null,{"$error":"#NAME?"},{"$error":"#NAME?"}]
[null,null,null,null,null,null,null,null,null,null,null,null,null,null,null,null,null,null,null,null,null,null,null,{"$error":"#NAME?"},{"$error":"#NAME?"}]
[null,null,null,null,null,null,null,null,null,null,null,null,null,null,null,null,null,null,null,null,null,null,null,{"$error":"#NAME?"},{"$error":"#NAME?"}]
[null,null,null,null,null,null,null,null,null,null,null,null,null,null,null,null,null,null,null,null,null,null,null,{"$error":"#NAME?"},{"$error":"#NAME?"}]
[null,null,null,null,null,null,null,null,null,null,null,null,null,null,null,null,null,null,null,null,null,null,null,{"$error":"#NAME?"},{"$error":"#NAME?"}]
[null,null,null,null,null,null,null,null,null,null,null,null,null,null,null,null,null,null,null,null,null,null,null,{"$error":"#NAME?"},{"$error":"#NAME?"}]
[null,null,null,null,null,null,null,null,null,null,null,null,null,null,null,null,null,null,null,null,null,null,null,{"$error":"#NAME?"},{"$error":"#NAME?"}]
[null,null,null,null,null,null,null,null,null,null,null,null,null,null,null,null,null,null,null,null,null,null,null,{"$error":"#NAME?"},{"$error":"#NAME?"}]
[null,null,null,null,null,null,null,null,null,null,null,null,null,null,null,null,null,null,null,null,null,null,null,{"$error":"#NAME?"},{"$error":"#NAME?"}]
[null,null,null,null,null,null,null,null,null,null,null,null,null,null,null,null,null,null,null,null,null,null,null,{"$error":"#NAME?"},{"$error":"#NAME?"}]
[null,null,null,null,null,null,null,null,null,null,null,null,null,null,null,null,null,null,null,null,null,null,null,{"$error":"#NAME?"},{"$error":"#NAME?"}]
[null,null,null,null,null,null,null,null,null,null,null,null,null,null,null,null,null,null,null,null,null,null,null,{"$error":"#NAME?"},{"$error":"#NAME?"}]
[null,null,null,null,null,null,null,null,null,null,null,null,null,null,null,null,null,null,null,null,null,null,null,{"$error":"#NAME?"},{"$error":"#NAME?"}]
[null,null,null,null,null,null,null,null,null,null,null,null,null,null,null,null,null,null,null,null,null,null,null,{"$error":"#NAME?"},{"$error":"#NAME?"}]
[null,null,null,null,null,null,null,null,null,null,null,null,null,null,null,null,null,null,null,null,null,null,null,{"$error":"#NAME?"},{"$error":"#NAME?"}]
[null,null,null,null,null,null,null,null,null,null,null,null,null,null,null,null,null,null,null,null,null,null,null,{"$error":"#NAME?"},{"$error":"#NAME?"}]
[null,null,null,null,null,null,null,null,null,null,null,null,null,null,null,null,null,null,null,null,null,null,null,{"$error":"#NAME?"},{"$error":"#NAME?"}]
[null,null,null,null,null,null,null,null,null,null,null,null,null,null,null,null,null,null,null,null,null,null,null,{"$error":"#NAME?"},{"$error":"#NAME?"}]
[null,null,null,null,null,null,null,null,null,null,null,null,null,null,null,null,null,null,null,null,null,null,null,{"$error":"#NAME?"},{"$error":"#NAME?"}]
[null,null,null,null,null,null,null,null,null,null,null,null,null,null,null,null,null,null,null,null,null,null,null,{"$error":"#NAME?"},{"$error":"#NAME?"}]
[null,null,null,null,null,null,null,null,null,null,null,null,null,null,null,null,null,null,null,null,null,null,null,{"$error":"#NAME?"},{"$error":"#NAME?"}]
[null,null,null,null,null,null,null,null,null,null,null,null,null,null,null,null,null,null,null,null,null,null,null,{"$error":"#NAME?"},{"$error":"#NAME?"}]
[null,null,null,null,null,null,null,null,null,null,null,null,null,null,null,null,null,null,null,null,null,null,null,{"$error":"#NAME?"},{"$error":"#NAME?"}]
[null,null,null,null,null,null,null,null,null,null,null,null,null,null,null,null,null,null,null,null,null,null,null,{"$error":"#NAME?"},{"$error":"#NAME?"}]
[null,null,null,null,null,null,null,null,null,null,null,null,null,null,null,null,null,null,null,null,null,null,null,{"$error":"#NAME?"},{"$error":"#NAME?"}]
[null,null,null,null,null,null,null,null,null,null,null,null,null,null,null,null,null,null,null,null,null,null,null,{"$error":"#NAME?"},{"$error":"#NAME?"}]
[null,null,null,null,null,null,null,null,null,null,null,null,null,null,null,null,null,null,null,null,null,null,null,{"$error":"#NAME?"},{"$error":"#NAME?"}]
[null,null,null,null,null,null,null,null,null,null,null,null,null,null,null,null,null,null,null,null,null,null,null,{"$error":"#NAME?"},{"$error":"#NAME?"}]
[null,null,null,null,null,null,null,null,null,null,null,null,null,null,null,null,null,null,null,null,null,null,null,{"$error":"#NAME?"},{"$error":"#NAME?"}]
[null,null,null,null,null,null,null,null,null,null,null,null,null,null,null,null,null,null,null,null,null,null,null,{"$error":"#NAME?"},{"$error":"#NAME?"}]
[null,null,null,null,null,null,null,null,null,null,null,null,null,null,null,null,null,null,null,null,null,null,null,{"$error":"#NAME?"},{"$error":"#NAME?"}]
[null,null,null,null,null,null,null,null,null,null,null,null,null,null,null,null,null,null,null,null,null,null,null,{"$error":"#NAME?"},{"$error":"#NAME?"}]
[null,null,null,null,null,null,null,null,null,null,null,null,null,null,null,null,null,null,null,null,null,null,null,{"$error":"#NAME?"},{"$error":"#NAME?"}]
[null,null,null,null,null,null,null,null,null,null,null,null,null,null,null,null,null,null,null,null,null,null,null,{"$error":"#NAME?"},{"$error":"#NAME?"}]
[null,null,null,null,null,null,null,null,null,null,null,null,null,null,null,null,null,null,null,null,null,null,null,{"$error":"#NAME?"},{"$error":"#NAME?"}]
[null,null,null,null,null,null,null,null,null,null,null,null,null,null,null,null,null,null,null,null,null,null,null,{"$error":"#NAME?"},{"$error":"#NAME?"}]
[null,null,null,null,null,null,null,null,null,null,null,null,null,null,null,null,null,null,null,null,null,null,null,{"$error":"#NAME?"},{"$error":"#NAME?"}]
[null,null,null,null,null,null,null,null,null,null,null,null,null,null,null,null,null,null,null,null,null,null,null,{"$error":"#NAME?"},{"$error":"#NAME?"}]
[null,null,null,null,null,null,null,null,null,null,null,null,null,null,null,null,null,null,null,null,null,null,null,{"$error":"#NAME?"},{"$error":"#NAME?"}]
[null,null,null,null,null,null,null,null,null,null,null,null,null,null,null,null,null,null,null,null,null,null,null,{"$error":"#NAME?"},{"$error":"#NAME?"}]
[null,null,null,null,null,null,null,null,null,null,null,null,null,null,null,null,null,null,null,null,null,null,null,{"$error":"#NAME?"},{"$error":"#NAME?"}]
[null,null,null,null,null,null,null,null,null,null,null,null,null,null,null,null,null,null,null,null,null,null,null,{"$error":"#NAME?"},{"$error":"#NAME?"}]
[null,null,null,null,null,null,null,null,null,null,null,null,null,null,null,null,null,null,null,null,null,null,null,{"$error":"#NAME?"},{"$error":"#NAME?"}]
[null,null,null,null,null,null,null,null,null,null,null,null,null,null,null,null,null,null,null,null,null,null,null,{"$error":"#NAME?"},{"$error":"#NAME?"}]
[null,null,null,null,null,null,null,null,null,null,null,null,null,null,null,null,null,null,null,null,null,null,null,{"$error":"#NAME?"},{"$error":"#NAME?"}]
[null,null,null,null,null,null,null,null,null,null,null,null,null,null,null,null,null,null,null,null,null,null,null,{"$error":"#NAME?"},{"$error":"#NAME?"}]
[null,null,null,null,null,null,null,null,null,null,null,null,null,null,null,null,null,null,null,null,null,null,null,{"$error":"#NAME?"},{"$error":"#NAME?"}]
[null,null,null,null,null,null,null,null,null,null,null,null,null,null,null,null,null,null,null,null,null,null,null,{"$error":"#NAME?"},{"$error":"#NAME?"}]
[null,null,null,null,null,null,null,null,null,null,null,null,null,null,null,null,null,null,null,null,null,null,null,{"$error":"#NAME?"},{"$error":"#NAME?"}]
[null,null,null,null,null,null,null,null,null,null,null,null,null,null,null,null,null,null,null,null,null,null,null,{"$error":"#NAME?"},{"$error":"#NAME?"}]
[null,null,null,null,null,null,null,null,null,null,null,null,null,null,null,null,null,null,null,null,null,null,null,{"$error":"#NAME?"},{"$error":"#NAME?"}]
[null,null,null,null,null,null,null,null,null,null,null,null,null,null,null,null,null,null,null,null,null,null,null,{"$error":"#NAME?"},{"$error":"#NAME?"}]
[null,null,null,null,null,null,null,null,null,null,null,null,null,null,null,null,null,null,null,null,null,null,null,{"$error":"#NAME?"},{"$error":"#NAME?"}]
[null,null,null,null,null,null,null,null,null,null,null,null,null,null,null,null,null,null,null,null,null,null,null,{"$error":"#NAME?"},{"$error":"#NAME?"}]
[null,null,null,null,null,null,null,null,null,null,null,null,null,null,null,null,null,null,null,null,null,null,null,{"$error":"#NAME?"},{"$error":"#NAME?"}]
[null,null,null,null,null,null,null,null,null,null,null,null,null,null,null,null,null,null,null,null,null,null,null,{"$error":"#NAME?"},{"$error":"#NAME?"}]
[null,null,null,null,null,null,null,null,null,null,null,null,null,null,null,null,null,null,null,null,null,null,null,{"$error":"#NAME?"},{"$error":"#NAME?"}]
[null,null,null,null,null,null,null,null,null,null,null,null,null,null,null,null,null,null,null,null,null,null,null,{"$error":"#NAME?"},{"$error":"#NAME?"}]
[null,null,null,null,null,null,null,null,null,null,null,null,null,null,null,null,null,null,null,null,null,null,null,{"$error":"#NAME?"},{"$error":"#NAME?"}]
[null,null,null,null,null,null,null,null,null,null,null,null,null,null,null,null,null,null,null,null,null,null,null,{"$error":"#NAME?"},{"$error":"#NAME?"}]
[null,null,null,null,null,null,null,null,null,null,null,null,null,null,null,null,null,null,null,null,null,null,null,{"$error":"#NAME?"},{"$error":"#NAME?"}]
[null,null,null,null,null,null,null,null,null,null,null,null,null,null,null,null,null,null,null,null,null,null,null,{"$error":"#NAME?"},{"$error":"#NAME?"}]
[null,null,null,null,null,null,null,null,null,null,null,null,null,null,null,null,null,null,null,null,null,null,null,{"$error":"#NAME?"},{"$error":"#NAME?"}]

{"sheet":"Hamburg Data","index":12,"n_rows":30,"n_cols":15,"rows_kept":30,"cut":false,"hidden":true,"merged":[[23,9,23,11],[18,12,18,14],[19,12,19,14],[20,12,20,14],[21,12,21,14],[22,12,22,14],[23,12,23,14],[18,9,18,11],[19,9,19,11],[20,9,20,11],[21,9,21,11],[22,9,22,11],[8,11,9,14],[10,11,11,14],[17,4,17,5],[17,6,17,8],[16,12,16,14],[16,0,16,5],[16,6,16,8],[16,9,16,11],[17,0,17,3],[18,0,18,3],[18,4,18,5],[18,6,18,8],[22,6,22,8],[25,4,25,5],[19,0,19,3],[20,4,20,5],[20,6,20,8],[21,4,21,5],[21,6,21,8],[19,4,19,5],[19,6,19,8],[27,4,27,5],[25,6,25,8],[26,6,26,8],[27,6,27,8],[23,4,23,5],[23,6,23,8],[25,9,25,11],[26,9,26,11],[27,9,27,11],[25,12,25,14],[26,12,26,14],[27,12,27,14]]}
[null,null,null,null,null,null,null,null,null,null,null,null,null,null,{"$f":"'Design Data'!U2","v":"October 2022"}]
["Kentucky Transportation Cabinet, Department of Highways, Division of Materials"]
["Asphalt Mixtures Testing Section"]
["1227 Wilkinson Boulevard, Frankfort, KY  40601-1226"]
[]
[]
["Hamburg Wheel-Track Testing Results"]
[]
["MIX ID #:",{"$f":"IF('Design Data'!H10=\"\",\"\",'Design Data'!H10)","v":""},null,null,null,"COUNTY:",null,{"$f":"IF('Design Data'!K10=\"\",\"\",'Design Data'!K10)","v":""},null,"TYPE OF MIX.:",null,{"$f":"'Chart Data'!W14","v":""}]
[]
["PROJ. #:",{"$f":"IF('Design Data'!C14=\"\",\"\",'Design Data'!C14)","v":"Enter Project(s) & Line Item(s)"},null,null,null,"LAB:",null,{"$f":"IF('Design Data'!H12=\"\",\"\",'Design Data'!H12)","v":""},null,"CONTR. & LOC.:",null,{"$f":"IF('Design Data'!Q14=\"\",\"\",'Design Data'!I15)","v":{"$error":"#N/A"}}]
[null,{"$f":"IF('Design Data'!C15=\"\",\"\",'Design Data'!C15)","v":"On 'Project Items' Tab."}]
["BIND. GRADE:",{"$f":"IF('Design Data'!C18=\"\",\"\",'Design Data'!C18)","v":""},null,null,null,"MADE WITH:",null,{"$f":"IF('Chart Data'!AJ37=\"\",\"\",'Chart Data'!AJ37)","v":""},null,"TEST METHOD:",null,"AASHTO T324"]
["(as per bid item)"]
["BIND. SOURCE:",{"$f":"IF('Design Data'!H18=\"\",\"\",'Design Data'!A17)","v":""},null,null,null,"MIX/COMP TEMP:",null,{"$f":"IF(H13=\"\",\"\",VLOOKUP(H13,'Chart Data'!J33:K36,2,FALSE))","v":""}]
[]
["S.I.P Criteria",null,null,null,null,null,"Pass Count",null,null,"Left Max",null,null,"Right Max"]
["Plot Count:",null,null,null,1000]
["Stripping Limit Depth:",null,null,null,"1 mm",null,100]
["Stripping Limit Count:",null,null,null,"50 passes",null,5000]
["Left Creep Slope Start:",null,null,null,1000,null,10000]
["Right Creep Slope Start:",null,null,null,1000,null,15000]
[null,null,null,null,null,null,20000]
[null,null,null,null,null,null,25000]
[]
["Left Max Rut Set Point:",null,null,null,null,null,"Max Deformation"]
[null,null,null,null,null,null,"Pass Number"]
["Right Max Rut Set Point:",null,null,null,null,null,"SIP"]
[]
["REMARKS:"]

{"sheet":"Error","index":13,"n_rows":0,"n_cols":0,"rows_kept":0,"cut":false,"hidden":true,"merged":[]}

{"sheet":"Chart Data","index":14,"n_rows":279,"n_cols":71,"rows_kept":279,"cut":false,"hidden":true,"merged":[]}
["Sieve","JMF","Opening","Op.^0.45","Control Points",null,null,"X-Plot","Y-Plot",null,null,{"$f":"IF(ISNUMBER('Design Data'!Q12),1,0)","v":0},null,{"$f":"IF($K$48=\"E\",1000,900)","v":900},{"$f":"IF($K$48=\"E\",N27+1000,N27+900)","v":25200},{"$f":"IF($K$48=\"E\",O27+1000,O27+900)","v":49500},{"$f":"IF($K$48=\"E\",P27+1000,P27+900)","v":73800},{"$f":"IF($K$48=\"E\",Q27+1000,Q27+900)","v":98100},null,0,0,null,"PG58-22",60025,{"$f":"IF(W14=\"\",\"\",VLOOKUP(W15,W1:Z12,4,FALSE))","v":""},1,{"$f":"IF($K$48=\"E\",R27+1000,R27+900)","v":122400},{"$f":"IF($K$48=\"E\",AA27+1000,AA27+900)","v":146700},{"$f":"IF($K$48=\"E\",AB27+1000,AB27+900)","v":171000},{"$f":"IF($K$48=\"E\",AC27+1000,AC27+900)","v":195300},{"$f":"IF($K$48=\"E\",AD27+1000,AD27+900)","v":219600},null,null,null,null,null,null,null,null,null,null,null,null,null,null,null,null,null,null,null,null,null,null,null,null,null,null,null,null,null,null,null,null,null,null,null,"Coarse Aggregate Angularity Criteria",null,null,"NMAS","VMA"]
["2\"",{"$f":"'Design Data'!T15","v":100},50,{"$f":"C2^0.45","v":5.8148230317277987},null,null,null,{"$f":"D2","v":5.8148230317277987},0,null,null,{"$f":"COUNTA('Design Data'!U16:U28)","v":1},null,{"$f":"IF($K$48=\"E\",N1+1000,N1+900)","v":1800},{"$f":"IF($K$48=\"E\",O1+1000,O1+900)","v":26100},{"$f":"IF($K$48=\"E\",P1+1000,P1+900)","v":50400},74700,99000,null,null,null,null,"PG58-28",60050,{"$f":"IF(W14=\"\",\"\",VLOOKUP(W15,W1:Z12,2,FALSE))","v":""},2,{"$f":"IF($K$48=\"E\",AA1+1000,AA1+900)","v":123300},147600,{"$f":"IF($K$48=\"E\",AC1+1000,AC1+900)","v":171900},{"$f":"IF($K$48=\"E\",AD1+1000,AD1+900)","v":196200},{"$f":"IF($K$48=\"E\",AE1+1000,AE1+900)","v":220500},null,null,"LAP100903","Asphalt Materials @ Warsaw, IN",null,null,null,"AMP090108      ","American Asphalt of West Virginia @ Kenova ",{"$error":"#N/A"},null,null,"Dol. #10's Unwashed","10293",null,null,"LU00642",null,null,"Nom. Max","Rec. Type","Range","Item Binder","Total","Nom. Max","Item Binder","Rec. Type","Eff. Bind","Virgin Binder","Design Nom. Max",null,{"$f":"'Chart Data'!J48","v":""},null,null,null,"N/A",null,null,"NO. 4",16]
["1 1/2\"",{"$f":"'Design Data'!T16","v":0},37.5,5.1087431744234335,25,{"$f":"E3^0.45","v":4.2566996126039234},100,{"$f":"D2","v":5.8148230317277987},100,null,null,{"$f":"COUNTA('Design Data'!T16:T28)","v":1},null,{"$f":"IF($K$48=\"E\",N2+1000,N2+900)","v":2700},{"$f":"IF($K$48=\"E\",O2+1000,O2+900)","v":27000},51300,75600,99900,null,null,null,null,"PG64-22",60075,null,3,124200,148500,172800,197100,221400,null,null,"LAP100201","ATS Asphalt Terminal @ Lexington",null,null,null,"AMP070101      ","ATS @ Lexington (Old Frankfort Pike)-Batch (#14)",null,null,null,"Dol. #10's Washed","10290",null,null,"LU01210",null,null,{"$f":"IF(OR($BK$2=0.5,$BK$2=0.38,$BK$2=\"No. 4\"),1,0)","v":0},{"$f":"IF($BK$7=BF3,1,0)","v":0},{"$f":"IF($BK$6<=17,1,0)","v":0},{"$f":"IF($BK$3=BE3,1,0)","v":0},{"$f":"SUM(AY3:BB3)","v":0},"0.5,0.38,No. 4","PG64-22","RAP","<=17","PG 64-22","Design Binder",null,{"$f":"F48","v":""},null,null,null,"<=100mm",">100 mm",null,0.38,15]
["1\"",{"$f":"'Design Data'!T17","v":0},25,4.2566996126039234,19,3.7621761023862978,100,{"$f":"D3","v":5.1087431744234335},null,null,null,{"$f":"IF(ISNUMBER('Design Data'!H20),1,0)","v":0},null,3600,27900,52200,76500,100800," "," ",null,null,"PG64-28",60100,null,4,125100,149400,173700,198000,222300,null,null,"LAP100302","BP @ Calumet",null,null,null,"AMP070303      ","ATS @ Lexington (Old Frankfort Pike)-Drum (#16)",null,null,null,"Dol. #11's Unwashed","10297",null,null,"LU02210",null,null,{"$f":"IF(OR($BK$2=0.5,$BK$2=0.38,$BK$2=\"No. 4\"),1,0)","v":0},0,{"$f":"IF(AND($BK$6>=18,$BK$6<=23),1,0)","v":0},{"$f":"IF($BK$3=BE4,1,0)","v":0},{"$f":"SUM(AY4:BB4)","v":0},"0.5,0.38,No. 4","PG64-22","RAP","18-23","PG 58-28","Design Eff. AC",null,{"$f":"'Recycle Data'!J17","v":0},null,null,null,"75/- (minimum)","75/- (minimum)",null,0.5,14]
["3/4\"",{"$f":"'Design Data'!T18","v":0},19,3.7621761023862978,19,3.7621761023862978,90,{"$f":"D3","v":5.1087431744234335},null,null,null,{"$f":"COUNTIF('Design Data'!O52:O70,\"\")","v":19},null,4500,28800,53100,77400,101700,"TSR =",2,null,null,"PG64-34",60125,null,5,126000,150300,174600,198900,223200,null,null,"LAP100301","BP Amoco @ Whiting, IN",null,null,null,"AMP070201      ","ATS @ Lexington (Old Richmond Road) (#15)",null,null,null,"Dol. #11's Washed","10295",null,null,"LU03210",null,null,0,0,{"$f":"IF($BK$6<=17,1,0)","v":0},0,0,"0.5,0.38,No. 4","PG76-22","RAP","<=17","PG 76-22","AC from Recycle",null,{"$f":"'Recycle Data'!J23","v":""},null,null,null,"85/80 (minimum)","85/80 (minimum)",null,0.75,13]
["1/2\"",{"$f":"'Design Data'!T19","v":0},12.5,3.116086507375345,12.5,3.116086507375345,90,{"$f":"D4","v":4.2566996126039234},null,null,null,null,null,5400,29700,54000,78300,102600,null,null,null,null,"PG70-22",60150,null,6,126900,151200,175500,199800,224100,null,null,"LAP100401","Buckeye Asphalt @ Cincinnati, OH",null,null,null,"AMP070309      ","ATS @ Lexington (Old Richmond Road) (#17)",null,null,null,"Dolomite #67's","10350",null,null,"LU04210",null,null,0,0,{"$f":"IF($BK$6<=10,1,0)","v":0},0,0,"0.5,0.38,No. 4","PG64-22","RAS","<=10","PG 64-22","Eff. Bind. Content",null,{"$f":"IF(OR(BK4=\"\",BK5=\"\"),\"\",ROUND(BK5/BK4*100,0))","v":""},null,null,null,"95/90 (minimum)","95/90 (minimum)",null,1,12]
["3/8\"",{"$f":"'Design Data'!T20","v":0},9.5,2.754074108566122,2.36,1.4716698795820382,49,{"$f":"D4","v":4.2566996126039234},null,"",null,null,{"$f":"IF(ISERROR(VLOOKUP(J7,J9:M12,4,FALSE)),\"\",VLOOKUP(J7,J9:M12,4,FALSE))","v":""},6300,30600,54900,79200,103500,null,null,null,null,"PG70-28",60175,null,7,127800,152100,176400,200700,225000,null,null,"LAP100803","Carrollton River Terminal @ Carrollton",null,null,null,"AMP060402      ","Barrett Paving @ Wilder",null,null,null,"Dolomite #67's Class A","10355",null,null,"LU05210",null,null,0,0,{"$f":"IF(AND($BK$6>=11,$BK$6<=15),1,0)","v":0},0,0,"0.5,0.38,No. 4","PG64-22","RAS","11-15","PG 58-28","RAP, RAS,Both?",null,{"$f":"IF(BK5=\"\",\"\",IF(AND(U55>=1,V55=0),\"RAS\",IF(AND(U55=0,V55>=1),\"RAP\",IF(AND(U55>=1,V55>=1),\"Both\",\"\"))))","v":""},null,null,null,"100/100 (minimum)","100/100 (minimum)",null,1.5,11]
["#4",{"$f":"'Design Data'!T22","v":0},4.75,2.0161002539629291,2.36,1.4716698795820382,23,{"$f":"D5","v":3.7621761023862978},null,null,null,null,null,7200,31500,55800,80100,104400,null,null,null,null,"PG76-22",60200,null,8,128700,153000,177300,201600,225900,null,null,"LAP100601","Ergon @ Nashville, TN",null,null,null,"AMP070304      ","Bluegrass Contracting @ Garrard County (Lancaster)",null,null,null,"Dolomite #67's Class B","10360",null,null,"LU06210",null,null,0,0,{"$f":"IF($BK$6<=12,1,0)","v":0},0,0,"0.5,0.38,No. 4","PG64-22","Both","<=12","PG 64-22"]
["#8",{"$f":"'Design Data'!T23","v":0},2.36,1.4716698795820382,7.4999999999999997E-2,0.31172925995349998,8,{"$f":"D5","v":3.7621761023862978},null,"New Mix Design",null,null,1,8100,32400,56700,81000,105300,"Complete SGC Des.",{"$f":"IF('Design Data'!N79=\"\",\"\",2525)","v":""},null,1,"PG76-28",60225,null,9,129600,153900,178200,202500,226800,null,null,"LAP100702","Greater Cin. Asphalt Term II @ Cin., OH",null,null,null,"AMP060301      ","Bluegrass Paving @ Florence",null,null,null,"Dolomite #68's","10365",null,null,"LU07210",null,null,0,0,{"$f":"IF(AND($BK$6>=13,$BK$6<=18),1,0)","v":0},0,0,"0.5,0.38,No. 4","PG64-22","Both","13-18","PG 58-28","Good?",null,{"$f":"IF(BK7=\"\",\"\",IF(OR(BC3=4,BC4=4,BC5=4,BC6=4,BC7=4,BC8=4,BC9=4,BC10=4,BC11=4,BC12=4,BC13=4,BC14=4,BC15=4,BC16=4),\"YES\",\"NO\"))","v":""},null,null,null,{"$f":"IF('Chart Data'!J48=\"NO. 4\",\"N/A\",IF(AND('Design Data'!H20=1,'Design Data'!K20<=100),BO4,IF(AND('Design Data'!H20=1,'Design Data'!K20>100),BP4,IF(AND('Design Data'!H20=2,'Design Data'!K20<=100),BO5,IF(AND('Design Data'!H20=2,'Design Data'!K20>100),BP5,IF(AND('Design Data'!H20=3,'Design Data'!K20<=100),BO6,IF(AND('Design Data'!H20=3,'Design Data'!K20>100),BP6,\"\")))))))","v":""},{"$f":"IF(AND('Design Data'!H20=4,'Design Data'!K20<=100),BO7,IF(AND('Design Data'!H20=4,'Design Data'!K20>100),BP7))","v":false},null,null,{"$f":"IF(OR(ISNUMBER('Chart Data'!J48),'Chart Data'!J48=\"NO. 4\"),VLOOKUP('Chart Data'!J48,'Chart Data'!BR2:BS7,2,FALSE),\"\")","v":""}]
["#16",{"$f":"'Design Data'!T24","v":0},1.18,1.0773254099250416,7.4999999999999997E-2,0.31172925995349998,2,{"$f":"D6","v":3.116086507375345},null,"Ref. Mix Design (project change only)",null,null,2,9000,33300,57600,81900,106200,"1-pt. SGC Des.",{"$f":"IF('Design Data'!Q79=\"\",\"\",1425)","v":""},null,null,"PG82-22",60250,null,10,130500,154800,179100,203400,227700,null,null,"LAP100801","Hinkle Asphalt @ Avon",null,null,null,"AMP030310","Charles Deweese Construction @ Franklin",null,null,null,"Dolomite #68's Class A","10370",null,null,"LU08210",null,null,{"$f":"IF(OR($BK$2=1.5,$BK$2=1,$BK$2=0.75),1,0)","v":0},0,{"$f":"IF($BK$6<=25,1,0)","v":0},0,0,"1.50,1.00,0.75","PG64-22","RAP","<=25","PG 64-22","Virgin Binder",null,{"$f":"IF(BK9=\"YES\",VLOOKUP(4,BC3:BH16,6,FALSE),\"\")","v":""}]
["#30",{"$f":"'Design Data'!T25","v":0},0.6,0.79463568224020453,7.4999999999999997E-2,0.31172925995349998,6,{"$f":"D6","v":3.116086507375345},null,"Ref. Mix Design (with changes)-same proj.",null,null,3,9900,34200,58500,82800,107100,"App.-New Design",{"$f":"IF('Design Data'!N80=\"\",\"\",85)","v":""},null,null,"PG82-28",60275,null,11,131400,155700,180000,204300,228600,null,null,"LAP100802","Hinkle Asphalt @ Somerset",null,null,null,"AMP020301      ","E & B Paving @ Chandler Indiana",null,null,null,"Dolomite #68's Class B","10375",null,null,"LU09210",null,null,{"$f":"IF(OR($BK$2=1.5,$BK$2=1,$BK$2=0.75),1,0)","v":0},0,{"$f":"IF(AND($BK$6>=26,$BK$6<=30),1,0)","v":0},0,0,"1.50,1.00,0.75","PG64-22","RAP","26-30","PG 58-28"]
["#50",{"$f":"'Design Data'!T26","v":0},0.3,0.58170736792793831,"Maximum Density Line",null,null,{"$f":"D7","v":2.754074108566122},null,"Ref. Mix Design (with changes)-different proj.",null,null,4,10800,35100,59400,83700,108000,"App.-Ref. Mix.",{"$f":"IF('Design Data'!Q80=\"\",\"\",45)","v":""},null,null,"CRS-2P",61075,null,12,132300,156600,180900,205200,229500,null,null,"LAP101001","Marathon Petroleum @ Ashland",null,null,null,"AMP060309      ","Eaton Asphalt Paving @ Butler",null,null,null,"Dolomite #78's","10380",null,null,"LU10210",null,null,0,0,{"$f":"IF($BK$6<=25,1,0)","v":0},0,0,"1.50,1.00,0.75","PG76-22","RAP","<=25","PG 76-22",null,null,null,null,null,null,"Fine Aggregate Angularity Criteria"]
["#100",{"$f":"'Design Data'!T27","v":0},0.15,0.42583471830473674,null,null,null,{"$f":"D7","v":2.754074108566122},null,null,null,null,null,11700,36000,60300,84600,108900,"1-pt. Check",{"$f":"IF('1-Pt. Check'!C30=\"\",\"\",60)","v":""},null,null,null,null,null,null,133200,157500,181800,206100,230400,null,null,"LAP101002","Marathon Petroleum @ Big Sandy",null,null,null,"AMP090303","Eaton Ashpalt Paving @ Maysville",null,null,null,"Dolomite #78's Class A","10385",null,null,"LU11210",null,null,0,0,{"$f":"IF($BK$6<=12,1,0)","v":0},0,0,"1.50,1.00,0.75","PG64-22","RAS","<=12","PG 64-22",null,null,null,null,null,null,"NMAS",{"$f":"J48","v":""}]
["#200",{"$f":"'Design Data'!T28","v":0},7.4999999999999997E-2,0.31172925995349998,0,{"$f":"E14^0.45","v":0},0,{"$f":"D8","v":2.0161002539629291},null,null,null,null,null,12600,36900,61200,85500,109800,"Skid Data",{"$f":"IF(L48=\"X\",200,\"\")","v":""},null,null,"",null,null,null,134100,158400,182700,207000,231300,null,null,"LAP101004","Marathon Petroleum @ Cane Run",null,null,null,"AMP060307      ","Eaton Asphalt Paving @ Richwood",null,null,null,"Dolomite #78's Class B","10390",null,null,"LU12210",null,null,0,0,{"$f":"IF(AND($BK$6>=13,$BK$6<=20),1,0)","v":0},0,0,"1.50,1.00,0.75","PG64-22","RAS","13-20","PG 58-28","Eff. AC (from charts)",null,"m",{"$f":"IFERROR(('Design Data'!L34-'Design Data'!L37)/('Design Data'!B34-'Design Data'!B37),\"\")","v":""},null,null,"ESAL",{"$f":"'Design Data'!H20","v":""}]
[null,0,0,0,{"$f":"IF(W14=\"\",\"\",VLOOKUP(I48,A35:B40,2,FALSE))","v":""},{"$f":"IF(W14=\"\",\"\",E15^0.45)","v":""},100,{"$f":"D8","v":2.0161002539629291},null,null,null,null,null,13500,37800,62100,86400,110700,"TOTAL",{"$f":"SUM(T9:T14)","v":0},null,null,{"$f":"IF(W14=\"\",\"\",IF(W14=\"Bid Item Not In Drop-Down List\",W24,VLOOKUP(W14,A50:F264,6,FALSE)))","v":""},null,null,null,135000,159300,183600,207900,232200,null,null,"LAP101007","Marathon Petroleum @ Knoxville, TN",null,null,null,"AMP060308      ","Eaton Asphalt Paving @ Sanfordtown",null,null,null,"Dolomite #8's","10395",null,null,null,null,null,0,0,{"$f":"IF($BK$6<=15,1,0)","v":0},0,0,"1.50,1.00,0.75","PG64-22","Both","<=15","PG 64-22",null,null,"b",{"$f":"IFERROR(('Design Data'!L34-'Chart Data'!BL14*'Design Data'!B34),\"\")","v":""},null,null,"Depth",{"$f":"'Design Data'!K20","v":0}]
[null,null,null,null,null,null,null,{"$f":"D9","v":1.4716698795820382},null,null,null,null,null,14400,38700,63000,87300,111600,null,null,null,null,{"$f":"IF(AND(W14=\"\",W20=\"\"),\"\",IF(AND(W14=\"Bid Item Not In Drop-Down List\",W20=\"\"),\"\",IF(W14=\"Bid Item Not In Drop-Down List\",VALUE(RIGHT(W20,1)),VLOOKUP(W14,A50:G264,7,FALSE))))","v":""},null,null,null,135900,160200,184500,208800,233100,null,null,"LAP101005","Marathon Petroleum @ Kuttawa",null,null,null,"AMP060302      ","Eaton Asphalt Paving @ Verona",null,null,null,"Dolomite #8's Class A","10400",null,null,null,null,null,0,0,{"$f":"IF(AND($BK$6>=16,$BK$6<=25),1,0)","v":0},0,0,"1.50,1.00,0.75","PG64-22","Both","16-25","PG 58-28",null,null,"x",{"$f":"IFERROR(Graphs!K131,\"\")","v":0},null,null,null,{"$f":"IF(AND(BP13=\"NO. 4\",BP14=2),45,IF(AND(BP13=\"NO. 4\",BP14>=3),45,IF(OR(AND(BP15<=100,BP14=2),AND(BP15>100,BP14=2)),40,IF(OR(AND(BP15>100,BP14=3),AND(BP15<=100,BP14=3)),43,45))))","v":45}]
[null,null,null,null,null,null,null,{"$f":"D9","v":1.4716698795820382},null,"Binder Source",null,false,null,15300,39600,63900,88200,112500,null,null,null,null,{"$f":"IF(W14=\"\",\"\",VLOOKUP(W14,A51:H264,8,FALSE))","v":""},{"$f":"IF(W22=\"0.38\",\"15.0\", IF(W22=\"0.50\",\"14.0\", IF(W22=\"0.75\",\"13.0\", IF(W22=\"1.00\", \"12.0\", IF(W22=\"1.50\", \"11.0\",\"\")))))","v":""},null,null,136800,161100,185400,209700,234000,null,null,"LAP101009","Marathon Petroleum @ Mt. Vernon, IN",null,null,null,"AMP090102      ","Flemingsburg Materials @ Flemingsburg",null,null,null,"Dolomite #8's Class B","10405",null,null,null,null,null,null,null,null,null,null,null,null,null,null,null,null,null,"y",{"$f":"IFERROR(ROUND(BL14*BL16+BL15,1),\"\")","v":""},null,null,"Criteria",{"$f":"IF(BP16=\"N/A\",\"N/A\",CONCATENATE(BP16,\" (minimun)\"))","v":"45 (minimun)"}]
["Sieve","ATDB JMF","Opening","Op.^0.45","Lower","Upper",null,{"$f":"D10","v":1.0773254099250416},"MIX/COMP TEMP:","Binder Grade",null,false,null,16200,40500,{"$f":"IF($K$48=\"E\",P17+1000,P17+900)","v":64800},{"$f":"IF($K$48=\"E\",Q17+1000,Q17+900)","v":89100},{"$f":"IF($K$48=\"E\",R17+1000,R17+900)","v":113400},null,null,null,null,null,null,null,null,137700,162000,186300,210600,234900,null,null,"LAP101006","Marathon Petroleum @ Nashville, TN",null,null,null,"AMP050309      ","Flynn Brothers Brooks Plant @ Shepherdsville",null,null,null,"Dolomite #9M's","10410"]
[1.5,{"$f":"'Design Data'!T16","v":0},37.5,{"$f":"C19^0.45","v":5.1087431744234335},100,100,null,{"$f":"D10","v":1.0773254099250416},null,"Plant",null,false,null,17100,41400,65700,90000,114300,null,null,null,null,"",null,null,null,138600,162900,187200,211500,235800,null,null,"LAP101003","Marathon Petroleum @ North Bend, OH",null,null,null,"AMP050302      ","Flynn Brothers Contracting @ Louisville",null,null,null,"Dolomite #9M's Class A","10415"]
[0.75,{"$f":"'Design Data'!T18","v":0},19,3.7621761023862978,85,100,null,{"$f":"D11","v":0.79463568224020453},null,"1-Point Check",null,false,null,18000,42300,66600,90900,115200,null,null,null,null,"",null,null,null,139500,163800,188100,212400,236700,null,null,"LAP101901","Middleport Terminal @ Gallipolis, OH",null,null,null,"AMP050303      ","Frankfort Materials @ Frankfort",null,null,null,"Dolomite #9M's Class B","10420"]
[0.5,{"$f":"'Design Data'!T19","v":0},12.5,3.116086507375345,35,65,null,{"$f":"D11","v":0.79463568224020453},null,null,null,{"$f":"IF(OR(L17,L18,L19,L20),\"TRUE\",\"FALSE\")","v":"FALSE"},null,18900,43200,67500,91800,116100,null,null,null,null,"",{"$f":"IF(W22=\"1.50\",\"20625\",IF(W22=\"1.00\",\"20600\",IF(W22=\"0.75\",\"20575\",IF(W22=\"0.38\",\"20500\", IF(AND(W22=\"0.50\",W21=\"ASPH SURF\"),\"20525\",\"20550\")))))","v":"20550"},null,null,140400,164700,189000,213300,237600,null,null,"LAP101101","Midwest Terminal @ Paducah",null,null,null,"AMP090109","Freedom Asphalt @ Owingsville, KY",null,null,null,"Dolomite Comb.-NSG","10300"]
[4,{"$f":"'Design Data'!T22","v":0},4.75,2.0161002539629291,0,20,null,{"$f":"D12","v":0.58170736792793831},null,null,null,null,null,19800,44100,68400,92700,117000,null,null,null,null,"",null,null,null,141300,165600,189900,214200,238500,null,null,"LAP101401","Phillips 66 (Tanco) @ Jeffersonville, IN",null,null,null,"AMP080101      ","Gaddie Shamrock @ Albany",null,null,null,"Dolomite NSG Class A","10430"]
[8,{"$f":"'Design Data'!T23","v":0},2.36,1.4716698795820382,0,10,null,{"$f":"D12","v":0.58170736792793831},null,null,null,null,null,20700,45000,69300,93600,117900,null,null,null,null,"",null,null,null,142200,166500,190800,215100,239400,null,null,"LAP101301","Phillips 66 @ Knoxville, TN",null,null,null,"AMP080402      ","Gaddie Shamrock @ Columbia (Plant 1-Mod. Cont.)",null,null,null,"Dolomite NSG Class B","10435"]
[200,{"$f":"'Design Data'!T28","v":0},7.4999999999999997E-2,0.31172925995349998,0,4,null,{"$f":"D13","v":0.42583471830473674},null,null,null,null,null,21600,45900,70200,94500,118800,null,null,null,null,"",null,null,null,143100,167400,191700,216000,240300,null,null,"LAP101404","Phillips 66 @ Wood River, IL",null,null,null,"AMP080301      ","Gaddie Shamrock, LLC @ Columbia Plant 2 (Drum)",null,null,null,"Dol. NSG Fine (Unwashed)","10323"]
[null,0,0,0,0,0,null,{"$f":"D13","v":0.42583471830473674},null,null,null,null,null,22500,46800,71100,95400,119700,null,null,null,null,null,null,null,null,144000,168300,192600,216900,241200,null,null,"LAP101102","S & Y Terminal, LLC @ Owensboro",null,null,null,"AMP050311      ","Hall Contracting @ Brooks",null,null,null,"Dol. NSG Fine (Washed)","10320"]
["Sieve","OGDC JMF","Opening","Op.^0.45","Lower","Upper",null,{"$f":"D14","v":0.31172925995349998},null,null,null,null,null,23400,47700,72000,96300,120600,null,null,null,null,null,null,null,null,144900,169200,193500,217800,242100,null,null,"LAP101201","Shelbyville Asphalt Terminal @ Shelbyville",null,null,null,"AMP050313","Hall Contracting @ Charlestown, IN",null,null,null,"Dolomite NSG-Coarse","10440"]
[0.5,{"$f":"'Design Data'!T19","v":0},12.5,{"$f":"C27^0.45","v":3.116086507375345},100,100,null,{"$f":"D14","v":0.31172925995349998},null,null,null,null,null,24300,48600,72900,97200,121500,null,null,null,null,null,null,null,null,145800,170100,194400,218700,243000,null,null,"LAP101501","Terry Asphalt @ Hamilton, OH",null,null,null,"AMP070305      ","Hamilton & Hinkle @ Georgetown (Drum #1)",null,null,null,"Dol. Sand (Unwashed)","10313"]
[0.38,{"$f":"'Design Data'!T20","v":0},9.5,2.754074108566122,90,100,null,{"$f":"D15","v":0},null,"PG64-22","300/265 (deg. F)",null,null,null,null,null,null,null,null,null,null,null,null,null,null,null,null,null,null,null,null,null,null,"LAP??????","Binder Source Not In Drop-Down List",null,null,null,"AMP040302      ","Haydon Materials @ Greensburg (Drum)",null,null,null,"Dol. Sand (Washed)","10310"]
[4,{"$f":"'Design Data'!T22","v":0},4.75,2.0161002539629291,25,50,null,{"$f":"D15","v":0},null,"PG70-22","315/285 (deg. F)",null,null,"1 - 1","7 - 4","14 - 3","21 - 2","28 - 1","Bid Item","0-20","21-30",">30",null,null,null,null,"34 - 4",{"$f":"CONCATENATE(LEFT(AA55,2),\" - 3\")","v":"41 - 3"},{"$f":"CONCATENATE(LEFT(AB55,2),\" - 2\")","v":"48 - 2"},{"$f":"CONCATENATE(LEFT(AC55,2)+1,\" - 1\")","v":"55 - 1"},{"$f":"CONCATENATE(LEFT(AD55,2),\" - 4\")","v":"61 - 4"},null,null,null,null,null,null,null,"AMP040303      ","Haydon Materials @ Lebanon",null,null,null,"Dolomite Sand Class A","10436"]
[8,{"$f":"'Design Data'!T23","v":0},2.36,1.4716698795820382,5,15,null,null,null,"PG76-22","330/300 (deg. F)",null,null,"1 - 2","8 - 1","14 - 4","21 - 3","28 - 2","PG76-22","PG76-22","PG76-22","PG76-22",null,null,null,null,{"$f":"CONCATENATE(LEFT(AA29,2)+1,\" - 1\")","v":"35 - 1"},{"$f":"CONCATENATE(LEFT(AB29,2),\" - 4\")","v":"41 - 4"},{"$f":"CONCATENATE(LEFT(AC29,2),\" - 3\")","v":"48 - 3"},{"$f":"CONCATENATE(LEFT(AD29,2),\" - 2\")","v":"55 - 2"},{"$f":"CONCATENATE(LEFT(AE29,2)+1,\" - 1\")","v":"62 - 1"},null,null,null,null,null,null,null,"AMP080305      ","Hinkle Contracting @ Bethelridge (Drum)",null,null,null,"Dolomite Sand Class B","10437"]
[200,{"$f":"'Design Data'!T28","v":0},7.4999999999999997E-2,0.31172925995349998,2,5,null,null,null,"CRS-2P","See Special Prov. 79",null,null,"1 - 3","8 - 2","15 - 1","21 - 4","28 - 3","PG70-22","PG70-22","PG64-22","Use KM 427",null,null,null,null,{"$f":"CONCATENATE(LEFT(AA30,2),\" - 2\")","v":"35 - 2"},{"$f":"CONCATENATE(LEFT(AB30,2)+1,\" - 1\")","v":"42 - 1"},{"$f":"CONCATENATE(LEFT(AC30,2),\" - 4\")","v":"48 - 4"},{"$f":"CONCATENATE(LEFT(AD30,2),\" - 3\")","v":"55 - 3"},{"$f":"CONCATENATE(LEFT(AE30,2),\" - 2\")","v":"62 - 2"},null,null,null,null,null,null,null,"AMP100201      ","Hinkle Contracting @ Bowen",null,null,null,"Granite #67's","10355"]
[null,0,0,0,0,0,null,null,null,null,null,null,null,"1 - 4","8 - 3","15 - 2","22 - 1","28 - 4","PG64-22","PG64-22","PG64-22","Use KM 427",null,null,null,null,{"$f":"CONCATENATE(LEFT(AA31,2),\" - 3\")","v":"35 - 3"},{"$f":"CONCATENATE(LEFT(AB31,2),\" - 2\")","v":"42 - 2"},{"$f":"CONCATENATE(LEFT(AC31,2)+1,\" - 1\")","v":"49 - 1"},{"$f":"CONCATENATE(LEFT(AD31,2),\" - 4\")","v":"55 - 4"},{"$f":"CONCATENATE(LEFT(AE31,2),\" - 3\")","v":"62 - 3"},null,null,null,null,null,null,null,"AMP100301      ","Hinkle Contracting @ Cave Run Stone",null,null,null,"Granite #78's","10385"]
[null,null,null,null,null,null,null,null,null,"PG64-22","300/265 (deg. F)",null,null,"2 - 1","8 - 4","15 - 3","22 - 2","29 - 1",null,null,null,null,null,null,null,null,{"$f":"CONCATENATE(LEFT(AA32,2),\" - 4\")","v":"35 - 4"},{"$f":"CONCATENATE(LEFT(AB32,2),\" - 3\")","v":"42 - 3"},{"$f":"CONCATENATE(LEFT(AC32,2),\" - 2\")","v":"49 - 2"},{"$f":"CONCATENATE(LEFT(AD32,2)+1,\" - 1\")","v":"56 - 1"},{"$f":"CONCATENATE(LEFT(AE32,2),\" - 4\")","v":"62 - 4"},null,null,null,null,null,null,null,"AMP110201      ","Hinkle Contracting @ Flat Lick",null,null,null,"Granite #8's","10400"]
["Inches","mm",null,null,null,null,null,null,null,"PG58-28","300/265 (deg. F)",null,null,"2 - 2","9 - 1","15 - 4","22 - 3","29 - 2",null,null,null,null,null,null,null,null,{"$f":"CONCATENATE(LEFT(AA33,2)+1,\" - 1\")","v":"36 - 1"},{"$f":"CONCATENATE(LEFT(AB33,2),\" - 4\")","v":"42 - 4"},{"$f":"CONCATENATE(LEFT(AC33,2),\" - 3\")","v":"49 - 3"},{"$f":"CONCATENATE(LEFT(AD33,2),\" - 2\")","v":"56 - 2"},{"$f":"CONCATENATE(LEFT(AE33,2)+1,\" - 1\")","v":"63 - 1"},null,null,null,null,null,null,null,"AMP100401      ","Hinkle Contracting @ Jackson",null,null,null,"Granite #9M's","10415"]
[2,50,null,null,null,null,null,null,null,"PG76-22","330/300 (deg. F)",null,null,"2 - 3","9 - 2","16 - 1","22 - 4","29 - 3",null,null,null,null,null,null,null,null,{"$f":"CONCATENATE(LEFT(AA34,2),\" - 2\")","v":"36 - 2"},{"$f":"CONCATENATE(LEFT(AB34,2)+1,\" - 1\")","v":"43 - 1"},{"$f":"CONCATENATE(LEFT(AC34,2),\" - 4\")","v":"49 - 4"},{"$f":"CONCATENATE(LEFT(AD34,2),\" - 3\")","v":"56 - 3"},{"$f":"CONCATENATE(LEFT(AE34,2),\" - 2\")","v":"63 - 2"},null,null,null,null,null,null,null,"AMP110301      ","Hinkle Contracting @ Lee County Virginia",null,null,null,"Granite Sand","10436"]
[1.5,37.5,null,null,null,null,null,null,null,"Other","See Applicable Spec.",null,null,"2 - 4","9 - 3","16 - 2","23 - 1","29 - 4",null,null,null,null,null,null,null,null,{"$f":"CONCATENATE(LEFT(AA35,2),\" - 3\")","v":"36 - 3"},{"$f":"CONCATENATE(LEFT(AB35,2),\" - 2\")","v":"43 - 2"},{"$f":"CONCATENATE(LEFT(AC35,2)+1,\" - 1\")","v":"50 - 1"},{"$f":"CONCATENATE(LEFT(AD35,2),\" - 4\")","v":"56 - 4"},{"$f":"CONCATENATE(LEFT(AE35,2),\" - 3\")","v":"63 - 3"},null,null,null,null,null,null,null,"AMP110304      ","Hinkle Contracting @ London",null,null,null,"Gravel #57's","10345"]
[1,25,null,null,null,null,null,null,null,null,null,null,null,"3 - 1","9 - 4","16 - 3","23 - 2","30 - 1",null,"Recycle selected:  Use PG 76-22 virgin binder.",null,null,null,null,null,null,{"$f":"CONCATENATE(LEFT(AA36,2),\" - 4\")","v":"36 - 4"},{"$f":"CONCATENATE(LEFT(AB36,2),\" - 3\")","v":"43 - 3"},{"$f":"CONCATENATE(LEFT(AC36,2),\" - 2\")","v":"50 - 2"},{"$f":"CONCATENATE(LEFT(AD36,2)+1,\" - 1\")","v":"57 - 1"},{"$f":"CONCATENATE(LEFT(AE36,2),\" - 4\")","v":"63 - 4"},null,null,null,"TSR's Made With:","",null,null,"AMP110204      ","Hinkle Contracting @ Middlesboro",null,null,null,"Gravel #67's","10355"]
[0.75,19,null,null,null,null,null,null,null,"WMA?",false,null,null,"3 - 2","10 - 1","16 - 4","23 - 3","30 - 2",null,"Recycle selected:  Use PG 70-22 virgin binder.",null,null,null,null,null,null,{"$f":"CONCATENATE(LEFT(AA37,2)+1,\" - 1\")","v":"37 - 1"},{"$f":"CONCATENATE(LEFT(AB37,2),\" - 4\")","v":"43 - 4"},{"$f":"CONCATENATE(LEFT(AC37,2),\" - 3\")","v":"50 - 3"},{"$f":"CONCATENATE(LEFT(AD37,2),\" - 2\")","v":"57 - 2"},{"$f":"CONCATENATE(LEFT(AE37,2)+1,\" - 1\")","v":"64 - 1"},null,null,null,null,null,null,null,"AMP090103      ","Hinkle Contracting @ Morehead (Batch)",null,null,null,"Gravel #78's","10385"]
[0.5,12.5,null,null,null,null,null,null,null,"PG64-22","265/245 (deg. F)",null,null,"3 - 3","10 - 2","17 - 1","23 - 4","30 - 3",null,"Recycle selected:  Use PG 64-22 virgin binder.",null,null,null,null,null,null,{"$f":"CONCATENATE(LEFT(AA38,2),\" - 2\")","v":"37 - 2"},{"$f":"CONCATENATE(LEFT(AB38,2)+1,\" - 1\")","v":"44 - 1"},{"$f":"CONCATENATE(LEFT(AC38,2),\" - 4\")","v":"50 - 4"},{"$f":"CONCATENATE(LEFT(AD38,2),\" - 3\")","v":"57 - 3"},{"$f":"CONCATENATE(LEFT(AE38,2),\" - 2\")","v":"64 - 2"},null,null,null,null,null,null,null,"AMP070306      ","Hinkle Contracting @ Paris",null,null,null,"Gravel #8's","10400"]
[0.38,9.5,null,null,null,null,null,null,null,"PG76-22","290/275 (deg. F)",null,null,"3 - 4","10 - 3","17 - 2","24 - 1","30 - 4",null,"Recycle selected:  Use KM 427 for virgin binder grade selection.",null,null,null,null,null,null,{"$f":"CONCATENATE(LEFT(AA39,2),\" - 3\")","v":"37 - 3"},{"$f":"CONCATENATE(LEFT(AB39,2),\" - 2\")","v":"44 - 2"},{"$f":"CONCATENATE(LEFT(AC39,2)+1,\" - 1\")","v":"51 - 1"},{"$f":"CONCATENATE(LEFT(AD39,2),\" - 4\")","v":"57 - 4"},{"$f":"CONCATENATE(LEFT(AE39,2),\" - 3\")","v":"64 - 3"},null,null,null,null,null,null,null,"AMP100101      ","Hinkle Contracting @ Pomp",null,null,null,"Gravel #9M's","10415"]
[null,null,null,null,null,null,null,null,null,null,null,null,null,"4 - 1","10 - 4","17 - 3","24 - 2","31 - 1",null,"Cannot use more than 20% Recycle with PG 76-22.",null,null,null,null,null,null,{"$f":"CONCATENATE(LEFT(AA40,2),\" - 4\")","v":"37 - 4"},{"$f":"CONCATENATE(LEFT(AB40,2),\" - 3\")","v":"44 - 3"},{"$f":"CONCATENATE(LEFT(AC40,2),\" - 2\")","v":"51 - 2"},{"$f":"CONCATENATE(LEFT(AD40,2)+1,\" - 1\")","v":"58 - 1"},{"$f":"CONCATENATE(LEFT(AE40,2),\" - 4\")","v":"64 - 4"},null,null,null,null,null,null,null,"AMP100402      ","Hinkle Contracting @ Ravenna",null,null,null,"Gravel Sand-Crushed","10305"]
[null,null,null,null,null,null,null,null,null,null,null,null,null,"4 - 2","11 - 1","17 - 4","24 - 3","31 - 2",null,"The contribution of Asphalt Binder from the reclaimed materials has exceeded the maximum.",null,null,null,null,null,null,{"$f":"CONCATENATE(LEFT(AA41,2)+1,\" - 1\")","v":"38 - 1"},{"$f":"CONCATENATE(LEFT(AB41,2),\" - 4\")","v":"44 - 4"},{"$f":"CONCATENATE(LEFT(AC41,2),\" - 3\")","v":"51 - 3"},{"$f":"CONCATENATE(LEFT(AD41,2),\" - 2\")","v":"58 - 2"},{"$f":"CONCATENATE(LEFT(AE41,2)+1,\" - 1\")","v":"65 - 1"},null,null,null,null,null,null,null,"AMP080304      ","Hinkle Contracting @ Somerset (Drum)",null,null,null,"LS #10's (Unwashed)","10293"]
[null,null,null,null,null,null,null,null,null,null,null,null,null,"4 - 3","11 - 2","18 - 1","24 - 4","31 - 3",null,{"$f":"IF(AND('Chart Data'!S55=\"Recycle\",'Chart Data'!Y1=6,'Chart Data'!T55<=20),T38,IF(AND('Chart Data'!S55=\"Recycle\",'Chart Data'!Y1=6,'Chart Data'!T55<=30),T39,IF(AND('Chart Data'!S55=\"Recycle\",'Chart Data'!Y1=6,'Chart Data'!T55>30),T40,T44)))","v":"(as specified in Bid Item)"},null,null,null,null,null,null,{"$f":"CONCATENATE(LEFT(AA42,2),\" - 2\")","v":"38 - 2"},{"$f":"CONCATENATE(LEFT(AB42,2)+1,\" - 1\")","v":"45 - 1"},{"$f":"CONCATENATE(LEFT(AC42,2),\" - 4\")","v":"51 - 4"},{"$f":"CONCATENATE(LEFT(AD42,2),\" - 3\")","v":"58 - 3"},{"$f":"CONCATENATE(LEFT(AE42,2),\" - 2\")","v":"65 - 2"},null,null,null,"No. 4 A",null,null,null,"AMP080303      ","Hinkle Contracting @ Tateville",null,null,null,"LS #10's (Washed)","10290"]
[null,null,null,null,null,null,null,null,null,null,null,null,null,"4 - 4","11 - 3","18 - 2","25 - 1","31 - 4",null,{"$f":"IF(AND('Chart Data'!S55=\"Recycle\",'Chart Data'!Y1=3,'Chart Data'!T55<=30),T39,IF(AND('Chart Data'!S55=\"Recycle\",'Chart Data'!Y1=3,'Chart Data'!T55>30),T40,\"(as specified in Bid Item)\"))","v":"(as specified in Bid Item)"},null,null,null,null,null,null,{"$f":"CONCATENATE(LEFT(AA43,2),\" - 3\")","v":"38 - 3"},{"$f":"CONCATENATE(LEFT(AB43,2),\" - 2\")","v":"45 - 2"},{"$f":"CONCATENATE(LEFT(AC43,2)+1,\" - 1\")","v":"52 - 1"},{"$f":"CONCATENATE(LEFT(AD43,2),\" - 4\")","v":"58 - 4"},{"$f":"CONCATENATE(LEFT(AE43,2),\" - 3\")","v":"65 - 3"},null,null,null,"No. 4 B",null,null,null,"AMP040301      ","E & B Paving @ Corydon Indiana",null,null,null,"LS #11's (Unwashed)","10297"]
[null,null,null,null,null,null,null,null,null,null,null,null,null,"5 - 1","11 - 4","18 - 3","25 - 2","32 - 1",null,null,null,null,null,null,null,null,{"$f":"CONCATENATE(LEFT(AA44,2),\" - 4\")","v":"38 - 4"},{"$f":"CONCATENATE(LEFT(AB44,2),\" - 3\")","v":"45 - 3"},{"$f":"CONCATENATE(LEFT(AC44,2),\" - 2\")","v":"52 - 2"},{"$f":"CONCATENATE(LEFT(AD44,2)+1,\" - 1\")","v":"59 - 1"},{"$f":"CONCATENATE(LEFT(AE44,2),\" - 4\")","v":"65 - 4"},null,null,null,"0.38 A",null,null,null,"AMP050304      ","E & B Paving @ Sellersburg Indiana",null,null,null,"LS #11's (Washed)","10295"]
[null,null,null,null,null,null,null,null,null,null,null,null,null,"5 - 2","12 - 1","18 - 4","25 - 3","32 - 2",null,null,null,null,null,null,null,null,{"$f":"CONCATENATE(LEFT(AA45,2)+1,\" - 1\")","v":"39 - 1"},{"$f":"CONCATENATE(LEFT(AB45,2),\" - 4\")","v":"45 - 4"},{"$f":"CONCATENATE(LEFT(AC45,2),\" - 3\")","v":"52 - 3"},{"$f":"CONCATENATE(LEFT(AD45,2),\" - 2\")","v":"59 - 2"},{"$f":"CONCATENATE(LEFT(AE45,2)+1,\" - 1\")","v":"66 - 1"},null,null,null,"0.38 B",null,null,null,"AMP020302      ","J H Rudolph @ Evansville Indiana ",null,null,null,"Limestone #357's","10325"]
[null,null,null,null,null,null,null,null,null,null,null,{"$f":"IF(W14=\"\",\"\",IF(W14=\"Bid Item Not In Drop-Down List\",W23,VLOOKUP(W14,A50:L264,12,FALSE)))","v":""},null,"5 - 3","12 - 2","19 - 1","25 - 4","32 - 3",null,null,null,null,null,null,null,null,{"$f":"CONCATENATE(LEFT(AA46,2),\" - 2\")","v":"39 - 2"},{"$f":"CONCATENATE(LEFT(AB46,2)+1,\" - 1\")","v":"46 - 1"},{"$f":"CONCATENATE(LEFT(AC46,2),\" - 4\")","v":"52 - 4"},{"$f":"CONCATENATE(LEFT(AD46,2),\" - 3\")","v":"59 - 3"},{"$f":"CONCATENATE(LEFT(AE46,2),\" - 2\")","v":"66 - 2"},null,null,null,"0.50 A",null,null,null,"AMP020308","J H Rudolph @ Henderson",null,null,null,"Limestone #467's","10335"]
[null,null,null,null,{"$f":"MID(F48,3,2)&RIGHT(F48,2)","v":""},{"$f":"IF(W14=\"\",\"\",IF(W14=\"Bid Item Not In Drop-Down List\",W24,VLOOKUP(W14,A50:J264,6,FALSE)))","v":""},{"$f":"IF(W14=\"\",\"\",VLOOKUP(W14,A50:J264,7,FALSE))","v":""},{"$f":"IF(W14=\"\",\"\",IF(W14=\"Bid Item Not In Drop-Down List\",X21,VLOOKUP(W14,A50:J264,8,FALSE)))","v":""},{"$f":"IF(W14=\"\",\"\",VLOOKUP(W14,A50:J264,9,FALSE))","v":""},{"$f":"IF(W14=\"Bid Item Not In Drop-Down List\",W22,IF(W14=\"\",\"\",VLOOKUP(W14,A50:J264,10,FALSE)))","v":""},{"$f":"IF(W14=\"Bid Item Not In Drop-Down List\",LEFT(W25,1),IF(W14=\"\",\"\",VLOOKUP(W14,A50:K264,11,FALSE)))","v":""},{"$f":"IF(L47=\"\",\"\",\"X\")","v":""},{"$f":"IF(W14=\"\",\"\",VLOOKUP(W14,A50:M264,13,FALSE))","v":""},"5 - 4","12 - 3","19 - 2","26 - 1","32 - 4",null,null,null,null,null,null,null,null,{"$f":"CONCATENATE(LEFT(AA47,2),\" - 3\")","v":"39 - 3"},{"$f":"CONCATENATE(LEFT(AB47,2),\" - 2\")","v":"46 - 2"},{"$f":"CONCATENATE(LEFT(AC47,2)+1,\" - 1\")","v":"53 - 1"},{"$f":"CONCATENATE(LEFT(AD47,2),\" - 4\")","v":"59 - 4"},{"$f":"CONCATENATE(LEFT(AE47,2),\" - 3\")","v":"66 - 3"},null,null,null,"0.50 B",null,null,null,"AMP020304      ","J H Rudolph @ St Croix Indiana",null,null,null,"Limestone #4's","10330"]
["Bid Item",null,null,null,"ASPHCEM Code","Bind. Gr.","ESAL","Mat. Code","Max.","NMAS","Metric?","Skid Data","cd_id","6 - 1","12 - 4","19 - 3","26 - 2","33 - 1",{"$f":"IF(LEFT('Design Data'!H23,3)=\"240\",'Design Data'!H23,\"\")","v":""},{"$f":"IF(S49=\"\",\"\",'Design Data'!M23)","v":""},{"$f":"IF(S49=24035,1,0)","v":0},{"$f":"IF(OR(S49=24025,S49=24030,S49=24033),1,0)","v":0},null,null,null,null,{"$f":"CONCATENATE(LEFT(AA48,2),\" - 4\")","v":"39 - 4"},{"$f":"CONCATENATE(LEFT(AB48,2),\" - 3\")","v":"46 - 3"},{"$f":"CONCATENATE(LEFT(AC48,2),\" - 2\")","v":"53 - 2"},{"$f":"CONCATENATE(LEFT(AD48,2)+1,\" - 1\")","v":"60 - 1"},{"$f":"CONCATENATE(LEFT(AE48,2),\" - 4\")","v":"66 - 4"},null,null,null,null,null,null,null,"AMP010301      ","Jim Smith Contracting @ Graves County (Hickory)",null,null,null,"Limestone #57's","10345"]
[null,null,null,null,null,null,null,null,null,null,null,null,null,"6 - 2","13 - 1","19 - 4","26 - 3","33 - 2",{"$f":"IF(LEFT('Design Data'!H24,3)=\"240\",'Design Data'!H24,\"\")","v":""},{"$f":"IF(S50=\"\",\"\",'Design Data'!M24)","v":""},0,0,null,null,null,null,{"$f":"CONCATENATE(LEFT(AA49,2)+1,\" - 1\")","v":"40 - 1"},{"$f":"CONCATENATE(LEFT(AB49,2),\" - 4\")","v":"46 - 4"},{"$f":"CONCATENATE(LEFT(AC49,2),\" - 3\")","v":"53 - 3"},{"$f":"CONCATENATE(LEFT(AD49,2),\" - 2\")","v":"60 - 2"},{"$f":"CONCATENATE(LEFT(AE49,2)+1,\" - 1\")","v":"67 - 1"},null,null,null,null,null,null,null,"AMP010101      ","Jim Smith Contracting @ Lake City (Batch)",null,null,null,"Limestone #5's","10340"]
["00018 DRAINAGE BLANKET-TYPE II-ASPH",null,null,null,"6422","PG64-22","N/A",20025,1.5,"ATDB","E",null,"M001","6 - 3","13 - 2","20 - 1","26 - 4","33 - 3",{"$f":"IF(LEFT('Design Data'!H25,3)=\"240\",'Design Data'!H25,\"\")","v":""},{"$f":"IF(S51=\"\",\"\",'Design Data'!M25)","v":""},0,0,null,null,null,null,{"$f":"CONCATENATE(LEFT(AA50,2),\" - 2\")","v":"40 - 2"},{"$f":"CONCATENATE(LEFT(AB50,2)+1,\" - 1\")","v":"47 - 1"},{"$f":"CONCATENATE(LEFT(AC50,2),\" - 4\")","v":"53 - 4"},{"$f":"CONCATENATE(LEFT(AD50,2),\" - 3\")","v":"60 - 3"},{"$f":"CONCATENATE(LEFT(AE50,2),\" - 2\")","v":"67 - 2"},null,null,null,null,null,null,null,"AMP010302      ","Jim Smith Contracting @ Lake City (Drum)",null,null,null,"Limestone #67's","10350"]
["00190 LEVELING & WEDGING (0.38-IN.) PG64-22",null,null,null,"6422",{"$f":"RIGHT(A52,7)","v":"PG64-22"},"N/A",20250,0.5,0.38,"E",null,"M003","6 - 4","13 - 3","20 - 2","27 - 1","33 - 4",{"$f":"IF(LEFT('Design Data'!H26,3)=\"240\",'Design Data'!H26,\"\")","v":""},{"$f":"IF(S52=\"\",\"\",'Design Data'!M26)","v":""},0,0,null,null,null,null,{"$f":"CONCATENATE(LEFT(AA51,2),\" - 3\")","v":"40 - 3"},{"$f":"CONCATENATE(LEFT(AB51,2),\" - 2\")","v":"47 - 2"},{"$f":"CONCATENATE(LEFT(AC51,2)+1,\" - 1\")","v":"54 - 1"},{"$f":"CONCATENATE(LEFT(AD51,2),\" - 4\")","v":"60 - 4"},{"$f":"CONCATENATE(LEFT(AE51,2),\" - 3\")","v":"67 - 3"},null,null,null,null,null,null,null,"AMP010303      ","Jim Smith Contracting @ Paducah",null,null,null,"LS #67's Class A","10355"]
["00190 LEVELING & WEDGING (0.50-IN.) PG64-22",null,null,null,"6422",{"$f":"RIGHT(A53,7)","v":"PG64-22"},"N/A",20275,0.75,0.5,"E",null,"M004","7 - 1","13 - 4","20 - 3","27 - 2","34 - 1",{"$f":"IF(LEFT('Design Data'!H27,3)=\"240\",'Design Data'!H27,\"\")","v":""},{"$f":"IF(S53=\"\",\"\",'Design Data'!M27)","v":""},0,0,null,null,null,null,{"$f":"CONCATENATE(LEFT(AA52,2),\" - 4\")","v":"40 - 4"},{"$f":"CONCATENATE(LEFT(AB52,2),\" - 3\")","v":"47 - 3"},{"$f":"CONCATENATE(LEFT(AC52,2),\" - 2\")","v":"54 - 2"},{"$f":"CONCATENATE(LEFT(AD52,2)+1,\" - 1\")","v":"61 - 1"},{"$f":"CONCATENATE(LEFT(AE52,2),\" - 4\")","v":"67 - 4"},null,null,null,null,null,null,null,"AMP060306      ","Len Riegler Blacktop @ Florence",null,null,null,"LS #67's Class B","10360"]
["00190 LEVELING & WEDGING (0.75-IN.) PG64-22",null,null,null,"6422",{"$f":"RIGHT(A54,7)","v":"PG64-22"},"N/A",20300,1,0.75,"E",null,"M005","7 - 2","14 - 1","20 - 4","27 - 3","34 - 2",{"$f":"IF(LEFT('Design Data'!H28,3)=\"240\",'Design Data'!H28,\"\")","v":""},{"$f":"IF(S54=\"\",\"\",'Design Data'!M28)","v":""},0,0,null,null,null,null,{"$f":"CONCATENATE(LEFT(AA53,2)+1,\" - 1\")","v":"41 - 1"},{"$f":"CONCATENATE(LEFT(AB53,2),\" - 4\")","v":"47 - 4"},{"$f":"CONCATENATE(LEFT(AC53,2),\" - 3\")","v":"54 - 3"},{"$f":"CONCATENATE(LEFT(AD53,2),\" - 2\")","v":"61 - 2"},{"$f":"CONCATENATE(LEFT(AE53,2)+1,\" - 1\")","v":"68 - 1"},null,null,null,null,null,null,null,"AMP110501      ","L-G Materials @ Corbin",null,null,null,"Limestone #68's","10365"]
["00190 LEVELING & WEDGING (1.00-IN.) PG64-22",null,null,null,"6422",{"$f":"RIGHT(A55,7)","v":"PG64-22"},"N/A",20325,1.5,1,"E",null,"M006","7 - 3","14 - 2","21 - 1","27 - 4","34 - 3",{"$f":"IF(AND(S49=\"\",S50=\"\",S51=\"\",S52=\"\",S53=\"\",S54=\"\"),\"\",\"Recycle\")","v":""},{"$f":"SUM(T49:T54)","v":0},{"$f":"SUM(U49:U54)","v":0},{"$f":"SUM(V49:V54)","v":0},{"$f":"SUM(U55:V55)","v":0},null,null,null,{"$f":"CONCATENATE(LEFT(AA54,2),\" - 2\")","v":"41 - 2"},{"$f":"CONCATENATE(LEFT(AB54,2)+1,\" - 1\")","v":"48 - 1"},{"$f":"CONCATENATE(LEFT(AC54,2),\" - 4\")","v":"54 - 4"},{"$f":"CONCATENATE(LEFT(AD54,2),\" - 3\")","v":"61 - 3"},{"$f":"CONCATENATE(LEFT(AE54,2),\" - 2\")","v":"68 - 2"},null,null,null,null,null,null,null,"AMP110502      ","L-G Materials @ Fariston",null,null,null,"LS #68's Class A","10370"]
["00190 LEVELING & WEDGING (1.50-IN.) PG64-22",null,null,null,"6422",{"$f":"RIGHT(A56,7)","v":"PG64-22"},"N/A",20350,2,1.5,"E",null,"M007",null,null," "," "," ",null,null,null,null,null,null,null,null,null,null,null,null,null,null,null,null,null,null,null,null,"AMP110202      ","L-G Materials @ Manchester",null,null,null,"LS #68's Class B","10375"]
["00191 ASPHALT SCRATCH COURSE (0.38-IN.) PG64-22",null,null,null,"6422",{"$f":"RIGHT(A57,7)","v":"PG64-22"},"N/A",20375,0.5,0.38,"E",null,"M013",null,null,null,null," ",null,null,null,null,null,null,null,null,{"$f":"IF($K$48=\"E\",AE27+1000,AE27+900)","v":243900},{"$f":"IF($K$48=\"E\",AA83+1000,AA83+900)","v":268200},{"$f":"IF($K$48=\"E\",AB83+1000,AB83+900)","v":292500},{"$f":"IF($K$48=\"E\",AC83+1000,AC83+900)","v":316800},{"$f":"IF($K$48=\"E\",AD83+1000,AD83+900)","v":341100},null,null,null,null,null,null,null,"AMP110203      ","L-G Materials @ McKee",null,null,null,"Limestone #78's","10380"]
["00191 ASPHALT SCRATCH COURSE (0.50-IN.) PG64-22",null,null,null,"6422","PG64-22","N/A",20400,0.75,0.5,"E",null,"M014",null,null,null,null,null,null,null,null,null,null,null,null,null,{"$f":"IF($K$48=\"E\",AA57+1000,AA57+900)","v":244800},269100,293400,317700,342000,null,null,null,null,null,null,null,"AMP080302      ","L-G Materials @ Mount Vernon",null,null,null,"LS #78's Class A","10385"]
["00191 ASPHALT SCRATCH COURSE (0.75-IN.) PG64-22",null,null,null,"6422","PG64-22","N/A",20425,1,0.75,"E",null,"M015",null,null,null,null,null,null,null,null,null,null,null,null,null,{"$f":"IF($K$48=\"E\",AA58+1000,AA58+900)","v":245700},270000,294300,318600,342900,null,null,null,null,null,null,null,"AMP110302      ","L-G Materials @ Pittsburg",null,null,null,"LS #78's Class B","10390"]
["00191 ASPHALT SCRATCH COURSE (1.00-IN.) PG64-22",null,null,null,"6422","PG64-22","N/A",20450,1.5,1,"E",null,"M016",null,null,null,null,null,null,null,null,null,null,null,null,null,246600,270900,295200,319500,343800,null,null,null,null,null,null,null,"AMP080306","L-G Materials @ Shopville",null,null,null,"Limestone #8's","10395"]
["00191 ASPHALT SCRATCH COURSE (1.50-IN.) PG64-22",null,null,null,"6422","PG64-22","N/A",20475,2,1.5,"E",null,"M017",null,null,null,null,null,null,null,null,null,null,null,null,null,247500,271800,296100,320400,344700,null,null,null,null,null,null,null,"AMP110305      ","L-G Materials @ Williamsburg",null,null,null,"LS #8's Class A","10400"]
["00193 ASPHALT SCRATCH COURSE (0.38-IN.) PG76-22",null,null,null,"7622","PG76-22","N/A",20375,0.5,0.38,"E",null,"M033",null,"ESAL Class","Mix Type","NMAS","Agg Des.","PG Binder Grade","Unit",null,null,null,null,null,null,248400,272700,297000,321300,345600,null,null,null,null,null,null,null,"AMP050308      ","Louisville Paving @ Brownsboro",null,null,null,"LS #8's Class B","10405"]
["00193 ASPHALT SCRATCH COURSE (0.50-IN.) PG76-22",null,null,null,"7622","PG76-22","N/A",20400,0.75,0.5,"E",null,"M034",null,null,null,null,null,null,null,null,null,null,null,null,null,249300,273600,297900,322200,346500,null,null,null,null,null,null,null,"AMP050301      ","Louisville Paving @ Middletown",null,null,null,"Limestone #9M's","10410"]
["00193 ASPHALT SCRATCH COURSE (0.75-IN.) PG76-22",null,null,null,"7622","PG76-22","N/A",20425,1,0.75,"E",null,"M035",null,"CL1","ASPH BASE","1.50","A","PG58-22","English",null,null,null,null,null,null,250200,274500,298800,323100,347400,null,null,null,null,null,null,null,"AMP050401      ","Louisville Paving @ Shepherdsville",null,null,null,"LS #9M's Class A","10415"]
["00193 ASPHALT SCRATCH COURSE (1.00-IN.) PG76-22",null,null,null,"7622","PG76-22","N/A",20450,1.5,1,"E",null,"M036",null,"CL2","ASPH BIND","1.00","B","PG58-28","Metric",null,null,null,null,null,null,251100,275400,299700,324000,348300,null,null,null,null,null,null,null,"AMP050101      ","Mac Construction @ Jeffersonville IN",null,null,null,"LS #9M's Class B","10420"]
["00193 ASPHALT SCRATCH COURSE (1.50-IN.) PG76-22",null,null,null,"7622","PG76-22","N/A",20475,2,1.5,"E",null,"M037",null,"CL3","ASPH SURF","0.75","D","PG64-22",null,null,null,null,null,null,null,252000,276300,300600,324900,349200,null,null,null,null,null,null,null,"AMP020103      ","Madisonville Paving @ Madisonville",null,null,null,"LS Combined-NSG","10300"]
["00194 LEVELING & WEDGING (0.38-IN.) PG76-22",null,null,null,"7622","PG76-22","N/A",20250,0.5,0.38,"E",null,"M043",null,"CL4",null,"0.50",null,"PG64-28",null,null,null,null,null,null,null,252900,277200,301500,325800,350100,null,null,null,null,null,null,null,"AMP040310      ","Mago Construction @ Bardstown (Drum)",null,null,null,"Limestone DGA","10425"]
["00194 LEVELING & WEDGING (0.50-IN.) PG76-22",null,null,null,"7622","PG76-22","N/A",20275,0.75,0.5,"E",null,"M044",null,null,null,"0.38",null,"PG64-34",null,null,null,null,null,null,null,253800,278100,302400,326700,351000,null,null,null,null,null,null,null,"AMP060303      ","Mago Construction @ Butler",null,null,null,"LS NSG Class A","10430"]
["00194 LEVELING & WEDGING (0.75-IN.) PG76-22",null,null,null,"7622","PG76-22","N/A",20300,1,0.75,"E",null,"M045",null,null,null,null,null,"PG70-22",null,null,null,null,null,null,null,254700,279000,303300,327600,351900,null,null,null,null,null,null,null,"AMP060104      ","Mago Construction @ Foster",null,null,null,"LS NSG Class B","10435"]
["00194 LEVELING & WEDGING (1.00-IN.) PG76-22",null,null,null,"7622","PG76-22","N/A",20325,1.5,1,"E",null,"M046",null,null,null,null,null,"PG70-28",null,null,null,null,null,null,null,255600,279900,304200,328500,352800,null,null,null,null,null,null,null,"AMP040102      ","Mago Construction @ Hardinsburg",null,null,null,"LS NSG-Coarse","10440"]
["00194 LEVELING & WEDGING (1.50-IN.) PG76-22",null,null,null,"7622","PG76-22","N/A",20350,2,1.5,"E",null,"M047",null,null,null,null,null,"PG76-22",null,null,null,null,null,null,null,256500,280800,305100,329400,353700,null,null,null,null,null,null,null,"AMP070102      ","Mago Construction @ Harrodsburg",null,null,null,"LS NSG-Fine (Unwashed)","10323"]
["00203 CL2 ASPH BASE 1.50D PG64-22",null,null,null,"6422","PG64-22",2,20625,2,1.5,"E",null,"M055",null,null,null,null,null,"PG76-28",null,null,null,null,null,null,null,257400,281700,306000,330300,354600,null,null,null,null,null,null,null,"AMP040103      ","Mago Construction @ Irvington",null,null,null,"LS NSG-Fine (Washed)","10320"]
["00205 CL3 ASPH BASE 1.50D PG64-22",null,null,null,"6422",{"$f":"RIGHT(A73,7)","v":"PG64-22"},3,20625,2,1.5,"E",null,"M059",null,null,null,null,null,"PG82-22",null,null,null,null,null,null,null,258300,282600,306900,331200,355500,null,null,null,null,null,null,null,"AMP050306      ","Mago Construction @ Lockport",null,null,null,"LSS (Unwashed)","10313"]
["00207 CL3 ASPH BASE 1.50D PG76-22",null,null,null,"7622","PG76-22",3,20625,2,1.5,"E",null,"M063",null,null,null,null,null,"PG82-28",null,null,null,null,null,null,null,{"$f":"IF($K$48=\"E\",AA73+1000,AA73+900)","v":259200},283500,307800,332100,356400,null,null,null,null,null,null,null,"AMP080103      ","Mago Construction @ Monticello",null,null,null,"LSS (Washed)","10310"]
["00208 CL4 ASPH BASE 1.50D PG64-22",null,null,null,"6422","PG64-22",4,20625,2,1.5,"E",null,"M065",null,null,null,null,null,"CRS-2P",null,null,null,null,null,null,null,{"$f":"IF($K$48=\"E\",AA74+1000,AA74+900)","v":260100},284400,308700,333000,357300,null,null,null,null,null,null,null,"AMP050307      ","Mago Construction @ Shepherdsville",null,null,null,"LSS Anti-Skid A (Unwashed)","10436"]
["00210 CL4 ASPH BASE 1.50D PG76-22",null,null,null,"7622","PG76-22",4,20625,2,1.5,"E",null,"M069",null,null,null,null,null,null,null,null,null,null,null,null,null,261000,285300,309600,333900,358200,null,null,null,null,null,null,null,"AMP070103      ","Mago Construction @ Tyrone",null,null,null,"LSS Anti-Skid A (Washed)","10436"]
["00212 CL2 ASPH BASE 1.00D PG64-22",null,null,null,"6422","PG64-22",2,20600,1.5,1,"E",null,"M073",null,null,null,null,null,null,null,null,null,null,null,null,null,261900,286200,310500,334800,359100,null,null,null,null,null,null,null,"AMP090104      ","Maysville Materials @ Maysville",null,null,null,"LSS Anti-Skid B (Unwashed)","10437"]
["00214 CL3 ASPH BASE 1.00D PG64-22",null,null,null,"6422","PG64-22",3,20600,1.5,1,"E",null,"M077",null,null,null,null,null,null,null,null,null,null,null,null,null,262800,287100,311400,335700,360000,null,null,null,null,null,null,null,"AMP090302      ","Mountain Enterprises @ Ashland",null,null,null,"LSS Anti-Skid B (Washed)","10437"]
["00216 CL3 ASPH BASE 1.00D PG76-22",null,null,null,"7622","PG76-22",3,20600,1.5,1,"E",null,"M081",null,null,null,null,null,null,null,null,null,null,null,null,null,263700,288000,312300,336600,360900,null,null,null,null,null,null,null,"AMP120307        ","Mountain Enterprises @ Cumberland",null,null,null,"Mineral Filler","10315"]
["00217 CL4 ASPH BASE 1.00D PG64-22",null,null,null,"6422","PG64-22",4,20600,1.5,1,"E",null,"M083",null,null,null,null,null,null,null,null,null,null,null,null,null,264600,288900,313200,337500,361800,null,null,null,null,null,null,null,"AMP090105      ","Mountain Enterprises @ Grassy Creek",null,null,null,"Natural Sand","10436"]
["00219 CL4 ASPH BASE 1.00D PG76-22",null,null,null,"7622","PG76-22",4,20600,1.5,1,"E",null,"M087",null,null,null,null,null,null,null,null,null,null,null,null,null,265500,289800,314100,338400,362700,null,null,null,null,null,null,null,"AMP110101      ","Mountain Enterprises @ Harlan",null,null,null,"Natural Rock Asphalt",24045]
["00221 CL2 ASPH BASE 0.75D PG64-22",null,null,null,"6422","PG64-22",2,20575,1,0.75,"E",null,"M091",null,null,null,null,null,null,null,null,null,null,null,null,null,266400,290700,315000,339300,363600,null,null,null,null,null,null,null,"AMP100303      ","Mountain Enterprises @ Hazard",null,null,null,"Coarse RAP","24025"]
["00223 CL3 ASPH BASE 0.75D PG64-22",null,null,null,"6422","PG64-22",3,20575,1,0.75,"E",null,"M095",null,null,null,null,null,null,null,null,null,null,null,null,null,267300,291600,315900,340200,364500,null,null,null,null,null,null,null,"AMP120102      ","Mountain Enterprises @ Inez",null,null,null,"Intermediate RAP",24030]
["00225 CL3 ASPH BASE 0.75D PG76-22",null,null,null,"7622","PG76-22",3,20575,1,0.75,"E",null,"M099",null,null,null,null,null,null,null,null,null,null,null,null,null,null,null,null,null,null,null,null,null,null,null,null,null,"AMP120301      ","Mountain Enterprises @ Jenkins",null,null,null,"Fine RAP",24033]
["00226 CL4 ASPH BASE 0.75D PG64-22",null,null,null,"6422","PG64-22",4,20575,1,0.75,"E",null,"M101",null,null,null,null,null,null,null,null,null,null,null,null,null,"68 - 3",{"$f":"CONCATENATE(LEFT(AA111,2),\" - 2\")","v":"75 - 2"},{"$f":"CONCATENATE(LEFT(AB111,2)+1,\" - 1\")","v":"83 - 1"},{"$f":"CONCATENATE(LEFT(AC111,2),\" - 4\")","v":"89 - 4"},{"$f":"CONCATENATE(LEFT(AD111,2),\" - 3\")","v":"96 - 3"},null,null,null,null,null,null,null,"AMP090106      ","Mountain Enterprises @ Kenova,WV",null,null,null,"Quartzite #8's Class A","10400"]
["00228 CL4 ASPH BASE 0.75D PG76-22",null,null,null,"7622","PG76-22",4,20575,1,0.75,"E",null,"M105",null,null,null,null,null,null,null,null,null,null,null,null,null,{"$f":"CONCATENATE(LEFT(AA85,2),\" - 4\")","v":"68 - 4"},{"$f":"CONCATENATE(LEFT(AB85,2),\" - 3\")","v":"75 - 3"},{"$f":"CONCATENATE(LEFT(AC85,2),\" - 2\")","v":"83 - 2"},{"$f":"CONCATENATE(LEFT(AD85,2)+1,\" - 1\")","v":"90 - 1"},{"$f":"CONCATENATE(LEFT(AE85,2),\" - 4\")","v":"96 - 4"},null,null,null,null,null,null,null,"AMP120306      ","Mountain Enterprises @ Louisa",null,null,null,"Quartzite #9M's Class A","10415"]
["06427 TRENCHING (0.38-IN.) PG64-22",null,null,null,"6422","PG64-22","N/A",20500,0.5,0.38,"E",null,"M107",null,null,null,null,null,null,null,null,null,null,null,null,null,{"$f":"CONCATENATE(LEFT(AA86,2)+1,\" - 1\")","v":"69 - 1"},{"$f":"CONCATENATE(LEFT(AB86,2)+1,\" - 4\")","v":"76 - 4"},{"$f":"CONCATENATE(LEFT(AC86,2),\" - 3\")","v":"83 - 3"},{"$f":"CONCATENATE(LEFT(AD86,2),\" - 2\")","v":"90 - 2"},{"$f":"CONCATENATE(LEFT(AE86,2)+1,\" - 1\")","v":"97 - 1"},null,null,null,null,null,null,null,"AMP120302      ","Mountain Enterprises @ Martin",null,null,null,"Quartzite Sand (Unwashed) Class A","10313"]
["06427 TRENCHING (0.38-IN.) PG76-22",null,null,null,"7622","PG76-22","N/A",20500,0.5,0.38,"E",null,"M109",null,"Agg. 1",{"$f":"COUNTA('Polish-Resistant Data'!B21:B33)","v":0},null,null,null,null,null,null,null,null,null,null,{"$f":"CONCATENATE(LEFT(AA87,2),\" - 2\")","v":"69 - 2"},{"$f":"CONCATENATE(LEFT(AB87,2)+1,\" - 1\")","v":"77 - 1"},{"$f":"CONCATENATE(LEFT(AC87,2),\" - 4\")","v":"83 - 4"},{"$f":"CONCATENATE(LEFT(AD87,2),\" - 3\")","v":"90 - 3"},{"$f":"CONCATENATE(LEFT(AE87,2),\" - 2\")","v":"97 - 2"},null,null,null,null,null,null,null,"AMP090107      ","Mountain Enterprises @ Olive Hill (Batch)",null,null,null,"Quartzite Sand (Washed) Class A","10310"]
["06427 TRENCHING (0.50-IN.) PG64-22",null,null,null,"6422",{"$f":"RIGHT(A89,7)","v":"PG64-22"},"N/A",20550,0.75,0.5,"E",null,"M111",null,"Agg. 2",{"$f":"COUNTA('Polish-Resistant Data'!C21:C33)","v":0},null,null,null,null,null,null,null,null,null,null,{"$f":"CONCATENATE(LEFT(AA88,2),\" - 3\")","v":"69 - 3"},{"$f":"CONCATENATE(LEFT(AB88,2),\" - 2\")","v":"77 - 2"},{"$f":"CONCATENATE(LEFT(AC88,2)+1,\" - 1\")","v":"84 - 1"},{"$f":"CONCATENATE(LEFT(AD88,2),\" - 4\")","v":"90 - 4"},{"$f":"CONCATENATE(LEFT(AE88,2),\" - 3\")","v":"97 - 3"},null,null,null,null,null,null,null,"AMP120304      ","Mountain Enterprises @ Shelbiana",null,null,null,"ROM","10300"]
["06427 TRENCHING (0.50-IN.) PG76-22",null,null,null,"7622","PG76-22","N/A",20550,0.75,0.5,"E",null,"M113",null,"Agg. 3",{"$f":"COUNTA('Polish-Resistant Data'!D21:D33)","v":0},null,null,null,null,null,null,null,null,null,null,{"$f":"CONCATENATE(LEFT(AA89,2),\" - 4\")","v":"69 - 4"},{"$f":"CONCATENATE(LEFT(AB89,2),\" - 3\")","v":"77 - 3"},{"$f":"CONCATENATE(LEFT(AC89,2),\" - 2\")","v":"84 - 2"},{"$f":"CONCATENATE(LEFT(AD89,2)+1,\" - 1\")","v":"91 - 1"},{"$f":"CONCATENATE(LEFT(AE89,2),\" - 4\")","v":"97 - 4"},null,null,null,null,null,null,null,"AMP120305      ","Mountain Enterprises @ Turkey Creek",null,null,null,"Sandst. #78’s Class A","10385"]
["06427 TRENCHING (0.75-IN.) PG64-22",null,null,null,"6422","PG64-22","N/A",20575,1,0.75,"E",null,"M115",null,"Agg. 4",{"$f":"COUNTA('Polish-Resistant Data'!E21:E33)","v":0},null,null,null,null,null,null,null,null,null,null,{"$f":"CONCATENATE(LEFT(AA90,2)+1,\" - 1\")","v":"70 - 1"},{"$f":"CONCATENATE(LEFT(AB90,2),\" - 4\")","v":"77 - 4"},{"$f":"CONCATENATE(LEFT(AC90,2),\" - 3\")","v":"84 - 3"},{"$f":"CONCATENATE(LEFT(AD90,2),\" - 2\")","v":"91 - 2"},{"$f":"CONCATENATE(LEFT(AE90,2)+1,\" - 1\")","v":"98 - 1"},null,null,null,null,null,null,null,"AMP010102      ","Murray Paving @ Murray (Batch)",null,null,null,"Sandst. #8’s Class A","10400"]
["06427 TRENCHING (0.75-IN.) PG76-22",null,null,null,"7622","PG76-22","N/A",20575,1,0.75,"E",null,"M117",null,"Agg. 5",{"$f":"COUNTA('Polish-Resistant Data'!F21:F33)","v":0},null,null,null,null,null,null,null,null,null,null,{"$f":"CONCATENATE(LEFT(AA91,2),\" - 2\")","v":"70 - 2"},{"$f":"CONCATENATE(LEFT(AB91,2)+1,\" - 1\")","v":"78 - 1"},{"$f":"CONCATENATE(LEFT(AC91,2),\" - 4\")","v":"84 - 4"},{"$f":"CONCATENATE(LEFT(AD91,2),\" - 3\")","v":"91 - 3"},{"$f":"CONCATENATE(LEFT(AE91,2),\" - 2\")","v":"98 - 2"},null,null,null,null,null,null,null,"AMP010307      ","Murray Paving @ Murray (Drum)",null,null,null,"Sandst. #9-M’s Class A","10415"]
["06427 TRENCHING (1.00-IN.) PG64-22",null,null,null,"6422","PG64-22","N/A",20600,1.5,1,"E",null,"M119",null,"Agg. 6",{"$f":"COUNTA('Polish-Resistant Data'!G21:G33)","v":0},null,null,null,null,null,null,null,null,null,null,{"$f":"CONCATENATE(LEFT(AA92,2),\" - 3\")","v":"70 - 3"},{"$f":"CONCATENATE(LEFT(AB92,2),\" - 2\")","v":"78 - 2"},{"$f":"CONCATENATE(LEFT(AC92,2)+1,\" - 1\")","v":"85 - 1"},{"$f":"CONCATENATE(LEFT(AD92,2),\" - 4\")","v":"91 - 4"},{"$f":"CONCATENATE(LEFT(AE92,2),\" - 3\")","v":"98 - 3"},null,null,null,null,null,null,null,"AMP060304      ","Ohio Valley Asphalt @ Carrollton",null,null,null,"Sandst. #11’s Class A","10295"]
["06427 TRENCHING (1.00-IN.) PG76-22",null,null,null,"7622","PG76-22","N/A",20600,1.5,1,"E",null,"M121",null,null,null,null,null,null,null,null,null,null,null,null,null,{"$f":"CONCATENATE(LEFT(AA93,2),\" - 4\")","v":"70 - 4"},{"$f":"CONCATENATE(LEFT(AB93,2),\" - 3\")","v":"78 - 3"},{"$f":"CONCATENATE(LEFT(AC93,2),\" - 2\")","v":"85 - 2"},{"$f":"CONCATENATE(LEFT(AD93,2)+1,\" - 1\")","v":"92 - 1"},{"$f":"CONCATENATE(LEFT(AE93,2),\" - 4\")","v":"98 - 4"},null,null,null,null,null,null,null,"AMP020303      ","Owensboro Paving @ Owensboro (Drum)",null,null,null,"Sandst. Sand (Unwashed) Class A","10313"]
["06427 TRENCHING (1.50-IN.) PG64-22",null,null,null,"6422","PG64-22","N/A",20625,2,1.5,"E",null,"M123",null,null,null,null,null,null,null,null,null,null,null,null,null,{"$f":"CONCATENATE(LEFT(AA94,2)+1,\" - 1\")","v":"71 - 1"},{"$f":"CONCATENATE(LEFT(AB94,2),\" - 4\")","v":"78 - 4"},{"$f":"CONCATENATE(LEFT(AC94,2),\" - 3\")","v":"85 - 3"},{"$f":"CONCATENATE(LEFT(AD94,2),\" - 2\")","v":"92 - 2"},{"$f":"CONCATENATE(LEFT(AE94,2)+1,\" - 1\")","v":"99 - 1"},null,null,null,null,null,null,null,"AMP020307      ","Owensboro Paving @ Owensboro (Drum#2)",null,null,null,"Sandst. Sand (Washed) Class A","10310"]
["06427 TRENCHING (1.50-IN.) PG76-22",null,null,null,"7622","PG76-22","N/A",20625,2,1.5,"E",null,"M125",null,{"$f":"SUM('Recycle Data'!K12:K15)","v":0},{"$f":"'Recycle Data'!K12/O96","v":{"$error":"#DIV/0!"}},{"$f":"IF('Recycle Data'!L12=\"\",\"\",('Recycle Data'!L12*P96))","v":""},null,null,null,null,null,null,null,null,null,{"$f":"CONCATENATE(LEFT(AA95,2),\" - 2\")","v":"71 - 2"},{"$f":"CONCATENATE(LEFT(AB95,2)+1,\" - 1\")","v":"79 - 1"},{"$f":"CONCATENATE(LEFT(AC95,2),\" - 4\")","v":"85 - 4"},{"$f":"CONCATENATE(LEFT(AD95,2),\" - 3\")","v":"92 - 3"},{"$f":"CONCATENATE(LEFT(AE95,2),\" - 2\")","v":"99 - 2"},null,null,null,null,null,null,null,"AMP020305      ","Pennyrile Asphalt @ Hopkinsville",null,null,null,"Shingles",24035]
["03240 BASE FAILURE REPAIR (0.75-IN) PG64-22",null,null,null,"6422","PG64-22","N/A",20575,1,0.75,"E",null,"M127",null,null,{"$f":"'Recycle Data'!K13/O96","v":{"$error":"#DIV/0!"}},{"$f":"IF('Recycle Data'!L13=\"\",\"\",('Recycle Data'!L13*P97))","v":""},null,null,null,null,null,null,null,null,null,{"$f":"CONCATENATE(LEFT(AA96,2),\" - 3\")","v":"71 - 3"},{"$f":"CONCATENATE(LEFT(AB96,2),\" - 2\")","v":"79 - 2"},{"$f":"CONCATENATE(LEFT(AC96,2)+1,\" - 1\")","v":"86 - 1"},{"$f":"CONCATENATE(LEFT(AD96,2),\" - 4\")","v":"92 - 4"},{"$f":"CONCATENATE(LEFT(AE96,2),\" - 3\")","v":"99 - 3"},null,null,null,null,null,null,null,"AMP050202      ","Riverside Paving @ Louisville",null,null,null,"Siltstone #67's","10355"]
["03240 BASE FAILURE REPAIR (0.75-IN) PG76-22",null,null,null,"7622","PG76-22","N/A",20575,1,0.75,"E",null,"M129",null,null,{"$f":"'Recycle Data'!K14/O96","v":{"$error":"#DIV/0!"}},{"$f":"IF('Recycle Data'!L14=\"\",\"\",('Recycle Data'!L14*P98))","v":""},null,null,null,null,null,null,null,null,null,{"$f":"CONCATENATE(LEFT(AA97,2),\" - 4\")","v":"71 - 4"},{"$f":"CONCATENATE(LEFT(AB97,2),\" - 3\")","v":"79 - 3"},{"$f":"CONCATENATE(LEFT(AC97,2),\" - 2\")","v":"86 - 2"},{"$f":"CONCATENATE(LEFT(AD97,2)+1,\" - 1\")","v":"93 - 1"},{"$f":"CONCATENATE(LEFT(AE97,2),\" - 4\")","v":"99 - 4"},null,null,null,null,null,null,null,"AMP010305      ","Rogers Group @ Canton",null,null,null,"Siltstone #78's","10385"]
["03240 BASE FAILURE REPAIR (1.00-IN) PG64-22",null,null,null,"6422","PG64-22","N/A",20600,1.5,1,"E",null,"M131",null,null,{"$f":"'Recycle Data'!K15/O96","v":{"$error":"#DIV/0!"}},{"$f":"IF('Recycle Data'!L15=\"\",\"\",('Recycle Data'!L15*P99))","v":""},{"$f":"IF(SUM(Q96:Q99)=0,\"\",SUM(Q96:Q99))","v":""},null,null,null,null,null,null,null,null,{"$f":"CONCATENATE(LEFT(AA98,2)+1,\" - 1\")","v":"72 - 1"},{"$f":"CONCATENATE(LEFT(AB98,2),\" - 4\")","v":"79 - 4"},{"$f":"CONCATENATE(LEFT(AC98,2),\" - 3\")","v":"86 - 3"},{"$f":"CONCATENATE(LEFT(AD98,2),\" - 2\")","v":"93 - 2"},{"$f":"CONCATENATE(LEFT(AE98,2)+1,\" - 1\")","v":"100 - 1"},null,null,null,null,null,null,null,"AMP020105      ","Rogers Group @ Henderson",null,null,null,"Siltstone #8's","10400"]
["03240 BASE FAILURE REPAIR (1.00-IN) PG76-22",null,null,null,"7622","PG76-22","N/A",20600,1.5,1,"E",null,"M133",null,null,null,null,null,null,null,null,null,null,null,null,null,{"$f":"CONCATENATE(LEFT(AA99,2),\" - 2\")","v":"72 - 2"},{"$f":"CONCATENATE(LEFT(AB99,2)+1,\" - 1\")","v":"80 - 1"},{"$f":"CONCATENATE(LEFT(AC99,2),\" - 4\")","v":"86 - 4"},{"$f":"CONCATENATE(LEFT(AD99,2),\" - 3\")","v":"93 - 3"},{"$f":"CONCATENATE(LEFT(AE99,3),\" - 2\")","v":"100 - 2"},null,null,null,null,null,null,null,"AMP020306      ","Rogers Group @ Hopkinsville (Drum)",null,null,null,"Siltstone #9M's","10415"]
["03240 BASE FAILURE REPAIR (1.50-IN) PG64-22",null,null,null,"6422","PG64-22","N/A",20625,2,1.5,"E",null,"M135",null,null,null,null,null,null,null,null,null,null,null,null,null,{"$f":"CONCATENATE(LEFT(AA100,2),\" - 3\")","v":"72 - 3"},{"$f":"CONCATENATE(LEFT(AB100,2),\" - 2\")","v":"80 - 2"},{"$f":"CONCATENATE(LEFT(AC100,2)+1,\" - 1\")","v":"87 - 1"},{"$f":"CONCATENATE(LEFT(AD100,2),\" - 4\")","v":"93 - 4"},{"$f":"CONCATENATE(LEFT(AE100,3),\" - 3\")","v":"100 - 3"},null,null,null,null,null,null,null,"AMP010306      ","Rogers Group @ Marion (Drum)",null,null,null,"Siltsone Sand","10436"]
["03240 BASE FAILURE REPAIR (1.50-IN) PG76-22",null,null,null,"7622","PG76-22","N/A",20625,2,1.5,"E",null,"M137",null,{"$f":"SUM('Recycle Data'!K12:K15)","v":0},{"$f":"'Recycle Data'!K12/O102","v":{"$error":"#DIV/0!"}},{"$f":"IF(OR('Recycle Data'!L12=\"\",'Recycle Data'!O12=\"\"),\"\",('Recycle Data'!O12*P102))","v":""},null,null,null,null,null,null,null,null,null,{"$f":"CONCATENATE(LEFT(AA101,2),\" - 4\")","v":"72 - 4"},{"$f":"CONCATENATE(LEFT(AB101,2),\" - 3\")","v":"80 - 3"},{"$f":"CONCATENATE(LEFT(AC101,2),\" - 2\")","v":"87 - 2"},{"$f":"CONCATENATE(LEFT(AD101,2)+1,\" - 1\")","v":"94 - 1"},{"$f":"CONCATENATE(LEFT(AE101,3),\" - 4\")","v":"100 - 4"},null,null,null,null,null,null,null,"AMP030311","Scottys Contracting @ Bowling Green (North)",null,null,null,"Slag #57's","10345"]
["00263 ASPHALT MIX FOR PAVEMENT WEDGE (0.38-IN.)",null,null,null,"6422","PG64-22","N/A",20225,0.5,0.38,"E",null,"M139",null,null,{"$f":"'Recycle Data'!K13/O102","v":{"$error":"#DIV/0!"}},{"$f":"IF(OR('Recycle Data'!L13=\"\",'Recycle Data'!O13=\"\"),\"\",('Recycle Data'!O13*P103))","v":""},null,null,null,null,null,null,null,null,null,{"$f":"CONCATENATE(LEFT(AA102,2)+1,\" - 1\")","v":"73 - 1"},{"$f":"CONCATENATE(LEFT(AB102,2),\" - 4\")","v":"80 - 4"},{"$f":"CONCATENATE(LEFT(AC102,2),\" - 3\")","v":"87 - 3"},{"$f":"CONCATENATE(LEFT(AD102,2),\" - 2\")","v":"94 - 2"},{"$f":"CONCATENATE(LEFT(AE102,3)+1,\" - 1\")","v":"101 - 1"},null,null,null,null,null,null,null,"AMP030303      ","Scottys Contracting @ Bowling Green (South)",null,null,null,"Slag #67's Class A","10355"]
["00263 ASPHALT MIX FOR PAVEMENT WEDGE (0.50-IN.)",null,null,null,"6422","PG64-22","N/A",20225,0.75,0.5,"E",null,"M140",null,null,{"$f":"'Recycle Data'!K14/O102","v":{"$error":"#DIV/0!"}},{"$f":"IF(OR('Recycle Data'!L14=\"\",'Recycle Data'!O14=\"\"),\"\",('Recycle Data'!O14*P104))","v":""},null,null,null,null,null,null,null,null,null,{"$f":"CONCATENATE(LEFT(AA103,2),\" - 2\")","v":"73 - 2"},{"$f":"CONCATENATE(LEFT(AB103,2)+1,\" - 1\")","v":"81 - 1"},{"$f":"CONCATENATE(LEFT(AC103,2),\" - 4\")","v":"87 - 4"},{"$f":"CONCATENATE(LEFT(AD103,2),\" - 3\")","v":"94 - 3"},{"$f":"CONCATENATE(LEFT(AE103,3),\" - 2\")","v":"101 - 2"},null,null,null,null,null,null,null,"AMP030305      ","Scottys Contracting @ Glasgow (\"Rambo\")",null,null,null,"Slag #67's Class B","10360"]
["00263 ASPHALT MIX FOR PAVEMENT WEDGE (0.75-IN.)",null,null,null,"6422","PG64-22","N/A",20225,1,0.75,"E",null,"M141",null,null,{"$f":"'Recycle Data'!K15/O102","v":{"$error":"#DIV/0!"}},{"$f":"IF(OR('Recycle Data'!L15=\"\",'Recycle Data'!O15=\"\"),\"\",('Recycle Data'!O15*P105))","v":""},{"$f":"IF(SUM(Q102:Q105)=0,\"\",SUM(Q102:Q105))","v":""},null,null,null,null,null,null,null,null,{"$f":"CONCATENATE(LEFT(AA104,2),\" - 3\")","v":"73 - 3"},{"$f":"CONCATENATE(LEFT(AB104,2),\" - 2\")","v":"81 - 2"},{"$f":"CONCATENATE(LEFT(AC104,2)+1,\" - 1\")","v":"88 - 1"},{"$f":"CONCATENATE(LEFT(AD104,2),\" - 4\")","v":"94 - 4"},{"$f":"CONCATENATE(LEFT(AE104,3),\" - 3\")","v":"101 - 3"},null,null,null,null,null,null,null,"AMP030301      ","Scottys Contracting @ Glasgow",null,null,null,"Slag #68's Class A","10370"]
["00263 ASPHALT MIX FOR PAVEMENT WEDGE (1.00-IN.)",null,null,null,"6422","PG64-22","N/A",20225,1.5,1,"E",null,"M142",null,null,null,null,null,null,null,null,null,null,null,null,null,{"$f":"CONCATENATE(LEFT(AA105,2),\" - 4\")","v":"73 - 4"},{"$f":"CONCATENATE(LEFT(AB105,2),\" - 3\")","v":"81 - 3"},{"$f":"CONCATENATE(LEFT(AC105,2),\" - 2\")","v":"88 - 2"},{"$f":"CONCATENATE(LEFT(AD105,2)+1,\" - 1\")","v":"95 - 1"},{"$f":"CONCATENATE(LEFT(AE105,3),\" - 4\")","v":"101 - 4"},null,null,null,null,null,null,null,"AMP020101      ","Scottys Contracting @ Greenville",null,null,null,"Slag #68's Class B","10375"]
["00263 ASPHALT MIX FOR PAVEMENT WEDGE (1.50-IN.)",null,null,null,"6422","PG64-22","N/A",20225,2,1.5,"E",null,"M143",null,null,null,null,null,null,null,null,null,null,null,null,null,{"$f":"CONCATENATE(LEFT(AA106,2)+1,\" - 1\")","v":"74 - 1"},{"$f":"CONCATENATE(LEFT(AB106,2),\" - 4\")","v":"81 - 4"},{"$f":"CONCATENATE(LEFT(AC106,2),\" - 3\")","v":"88 - 3"},{"$f":"CONCATENATE(LEFT(AD106,2),\" - 2\")","v":"95 - 2"},{"$f":"CONCATENATE(LEFT(AE106,3)+1,\" - 1\")","v":"102 - 1"},null,null,null,null,null,null,null,"AMP020309     ","Scottys Contracting @ Hartford",null,null,null,"Slag #78's Class A","10385"]
["00267 ASPH SURF OPEN-GRADED PG64-22",null,null,null,"6422",{"$f":"RIGHT(A108,7)","v":"PG64-22"},"N/A",20050,0.5,"OGFC","E","A","M151",null,{"$f":"SUM('Recycle Data'!K12:K15)","v":0},{"$f":"'Recycle Data'!K12/O108","v":{"$error":"#DIV/0!"}},{"$f":"IF(OR('Recycle Data'!L12=\"\",'Recycle Data'!P12=\"\"),\"\",('Recycle Data'!P12*P108))","v":""},null,null,null,null,null,null,null,null,null,{"$f":"CONCATENATE(LEFT(AA107,2),\" - 2\")","v":"74 - 2"},{"$f":"CONCATENATE(LEFT(AB107,2)+1,\" - 1\")","v":"82 - 1"},{"$f":"CONCATENATE(LEFT(AC107,2),\" - 4\")","v":"88 - 4"},{"$f":"CONCATENATE(LEFT(AD107,2),\" - 3\")","v":"95 - 3"},{"$f":"CONCATENATE(LEFT(AE107,3),\" - 2\")","v":"102 - 2"},null,null,null,null,null,null,null,"AMP020310","Scottys Contracting @ Madisonville (\"Rocky\")",null,null,null,"Slag #78's Class B","10390"]
["00268 ASPH SURF OPEN-GRADED PG76-22",null,null,null,"7622",{"$f":"RIGHT(A109,7)","v":"PG76-22"},"N/A",20050,0.5,"OGFC","E","A","M153",null,null,{"$f":"'Recycle Data'!K13/O108","v":{"$error":"#DIV/0!"}},{"$f":"IF(OR('Recycle Data'!L13=\"\",'Recycle Data'!P13=\"\"),\"\",('Recycle Data'!P13*P109))","v":""},null,null,null,null,null,null,null,null,null,{"$f":"CONCATENATE(LEFT(AA108,2),\" - 3\")","v":"74 - 3"},{"$f":"CONCATENATE(LEFT(AB108,2),\" - 2\")","v":"82 - 2"},{"$f":"CONCATENATE(LEFT(AC108,2)+1,\" - 1\")","v":"89 - 1"},{"$f":"CONCATENATE(LEFT(AD108,2),\" - 4\")","v":"95 - 4"},{"$f":"CONCATENATE(LEFT(AE108,3),\" - 3\")","v":"102 - 3"},null,null,null,null,null,null,null,"AMP020311","Scottys Contracting @ Madisonville (\"Rolling Thunder\")",null,null,null,"Slag #8's Class A","10400"]
["00269 MODIFIED OPEN-GRADED DRAINAGE COURSE",null,null,null,"6422","PG64-22","N/A",20075,0.5,"OGDC","E",null,"M155",null,null,{"$f":"'Recycle Data'!K14/O108","v":{"$error":"#DIV/0!"}},{"$f":"IF(OR('Recycle Data'!L14=\"\",'Recycle Data'!P14=\"\"),\"\",('Recycle Data'!P14*P110))","v":""},null,null,null,null,null,null,null,null,null,{"$f":"CONCATENATE(LEFT(AA109,2),\" - 4\")","v":"74 - 4"},{"$f":"CONCATENATE(LEFT(AB109,2),\" - 3\")","v":"82 - 3"},{"$f":"CONCATENATE(LEFT(AC109,2),\" - 2\")","v":"89 - 2"},{"$f":"CONCATENATE(LEFT(AD109,2)+1,\" - 1\")","v":"96 - 1"},{"$f":"CONCATENATE(LEFT(AE109,3),\" - 4\")","v":"102 - 4"},null,null,null,null,null,null,null,"AMP040311      ","Scottys Contracting @ Upton (\"Rocky\")",null,null,null,"Slag #8's Class B","10405"]
["00272 CL2 ASPH BIND 0.50D PG64-22",null,null,null,"6422",{"$f":"RIGHT(A111,7)","v":"PG64-22"},2,20550,0.75,0.5,"E",null,"M158",null,null,{"$f":"'Recycle Data'!#REF!/O108","v":{"$error":"#REF!"}},{"$f":"IF('Recycle Data'!L15=\"\",\"\",('Recycle Data'!P15*P111))","v":""},{"$f":"IF(SUM(Q108:Q111)=0,\"\",SUM(Q108:Q111))","v":""},null,null,null,null,null,null,null,null,{"$f":"CONCATENATE(LEFT(AA110,2)+1,\" - 1\")","v":"75 - 1"},{"$f":"CONCATENATE(LEFT(AB110,2),\" - 4\")","v":"82 - 4"},{"$f":"CONCATENATE(LEFT(AC110,2),\" - 3\")","v":"89 - 3"},{"$f":"CONCATENATE(LEFT(AD110,2),\" - 2\")","v":"96 - 2"},{"$f":"CONCATENATE(LEFT(AE110,3),\" - 1\")","v":"102 - 1"},null,null,null,null,null,null,null,"AMP040308","Scottys Contracting @ Leitchfield (Drum #3)",null,null,null,"Slag #9M's Class A","10415"]
["00274 CL3 ASPH BIND 0.50D PG64-22",null,null,null,"6422","PG64-22",3,20550,0.75,0.5,"E",null,"M162",null,null,null,null,null,null,null,null,null,null,null,null,null,null,null,null,null,null,null,null,null,null,null,null,null,"AMP030306      ","Scottys Contracting @ Russellville",null,null,null,"Slag #9M's Class B","10420"]
["00276 CL3 ASPH BIND 0.50D PG76-22",null,null,null,"7622","PG76-22",3,20550,0.75,0.5,"E",null,"M166",null,null,null,null,null,null,null,null,null,null,null,null,null,{"$f":"IF($K$48=\"E\",AE83+1000,AE83+900)","v":365400},{"$f":"IF($K$48=\"E\",AA139+1000,AA139+900)","v":389700},{"$f":"IF($K$48=\"E\",AB139+1000,AB139+900)","v":414000},{"$f":"IF($K$48=\"E\",AC139+1000,AC139+900)","v":438300},{"$f":"IF($K$48=\"E\",AD139+1000,AD139+900)","v":462600},null,null,null,null,null,null,null,"AMP030309      ","Scottys Contracting @ Scottsville ",null,null,null,"Slag NSG Class A","10430"]
["00277 CL4 ASPH BIND 0.50D PG64-22",null,null,null,"6422","PG64-22",4,20550,0.75,0.5,"E",null,"M168",null,"Recycle Information",null,null,null,null,null,null,null,null,null,null,null,{"$f":"IF($K$48=\"E\",AA113+1000,AA113+900)","v":366300},{"$f":"IF($K$48=\"E\",AB113+1000,AB113+900)","v":390600},{"$f":"IF($K$48=\"E\",AC113+1000,AC113+900)","v":414900},{"$f":"IF($K$48=\"E\",AD113+1000,AD113+900)","v":439200},{"$f":"IF($K$48=\"E\",AE113+1000,AE113+900)","v":463500},null,null,null,null,null,null,null,"AMP030307      ","Scottys Contracting @ Tompkinsville (\"Top Gun\")",null,null,null,"Slag NSG Class B","10435"]
["00279 CL4 ASPH BIND 0.50D PG76-22",null,null,null,"7622","PG76-22",4,20550,0.75,0.5,"E",null,"M172",null,"%AC in Recycle:",null,{"$f":"R99","v":""},null,null,null,null,null,null,null,null,null,367200,391500,415800,440100,464400,null,null,null,null,null,null,null,"AMP040309      ","Scottys Contracting @ Upton (\"Rolling Thunder\")",null,null,null,"Slag Sand Class A","10436"]
["00301 CL2 ASPH SURF 0.38D PG64-22",null,null,null,"6422","PG64-22",2,20500,0.5,0.38,"E",null,"M176",null,"%Virgin AC in mix:",null,{"$f":"'Recycle Data'!J24","v":""},null,null,null,null,null,null,null,null,null,368100,392400,416700,441000,465300,null,null,null,null,null,null,null,"AMP040304","Scottys Contracting @ Vine Grove",null,null,null,"Slag Sand Class B","10437"]
["00307 CL2 ASPH SURF 0.38B PG64-22",null,null,null,"6422","PG64-22",2,20500,0.5,0.38,"E","B","M188",null,"%Recycle AC in mix:",null,{"$f":"'Recycle Data'!J23","v":""},null,null,null,null,null,null,null,null,null,369000,393300,417600,441900,466200,null,null,null,null,null,null,null,"AMP030304      ","Scottys Contracting @ Woodburn (\"Boll Weevil\")"]
["00309 CL2 ASPH SURF 0.50D PG64-22",null,null,null,"6422","PG64-22",2,20525,0.75,0.5,"E",null,"M192",null,"Total %AC in mix:",null,{"$f":"IF(OR(Q116=\"\",Q117=\"\"),\"\",(Q116+Q117))","v":""},null,null,null,null,null,null,null,null,null,369900,394200,418500,442800,467100,null,null,null,null,null,null,null,"AMP050102      ","Shelbyville Asphalt @ Shelbyville"]
["00311 CL2 ASPH SURF 0.38B PG76-22",null,null,null,"7622",{"$f":"RIGHT(A119,7)","v":"PG76-22"},2,20500,0.5,0.38,"E","B","M338",null,null,null,null,null,null,null,null,null,null,null,null,null,370800,395100,419400,443700,468000,null,null,null,null,null,null,null,"AMP070301      ","The Allen Company @ Berea"]
["00312 CL3 ASPH SURF 0.50D PG64-22",null,null,null,"6422",{"$f":"RIGHT(A120,7)","v":"PG64-22"},3,20525,0.75,0.5,"E",null,"M194",null,null,null,null,null,null,null,null,null,null,null,null,null,371700,396000,420300,444600,468900,null,null,null,null,null,null,null,"AMP070302      ","The Allen Company @ Boonesborough"]
["00314 CL3 ASPH SURF 0.50D PG76-22",null,null,null,"7622",{"$f":"RIGHT(A121,7)","v":"PG76-22"},3,20525,0.75,0.5,"E","B","M198",null,null,null,null,null,null,null,null,null,null,null,null,null,372600,396900,421200,445500,469800,null,null,null,null,null,null,null,"AMP110306","The Allen Company @ Clover Bottom"]
["00324 CL3 ASPH SURF 0.50B PG64-22",null,null,null,"6422",{"$f":"RIGHT(A122,7)","v":"PG64-22"},3,20525,0.75,0.5,"E","B","M218",null,null,null,null,null,null,null,null,null,null,null,null,null,373500,397800,422100,446400,470700,null,null,null,null,null,null,null,"AMP070311      ","The Allen Company @ Danville (Drum)"]
["00326 CL3 ASPH SURF 0.50B PG76-22",null,null,null,"7622","PG76-22",3,20525,0.75,0.5,"E","B","M356",null,null,null,null,null,null,null,null,null,null,null,null,null,374400,398700,423000,447300,471600,null,null,null,null,null,null,null,"AMP070501      ","The Allen Company @ Danville"]
["00327 CL4 ASPH SURF 0.50B PG64-22",null,null,null,"6422","PG64-22",4,20525,0.75,0.5,"E","B","M224",null,null,null,null,null,null,null,null,null,null,null,null,null,375300,399600,423900,448200,472500,null,null,null,null,null,null,null,"AMP070307      ","The Allen Company Lexington Quarry @ Nicholasville"]
["00329 CL4 ASPH SURF 0.50B PG76-22",null,null,null,"7622","PG76-22",4,20525,0.75,0.5,"E","B","M228",null,null,null,null,null,null,null,null,null,null,null,null,null,376200,400500,424800,449100,473400,null,null,null,null,null,null,null,"AMP100302      ","The Walker Company @ Frenchburg"]
["00330 CL3 ASPH SURF 0.50A PG64-22",null,null,null,"6422","PG64-22",3,20525,0.75,0.5,"E","A","M230",null,null,null,null,null,null,null,null,null,null,null,null,null,377100,401400,425700,450000,474300,null,null,null,null,null,null,null,"AMP070308      ","The Walker Company @ Mount Sterling"]
["00332 CL3 ASPH SURF 0.50A PG76-22",null,null,null,"7622","PG76-22",3,20525,0.75,0.5,"E","A","M234",null,null,null,null,null,null,null,null,null,null,null,null,null,378000,402300,426600,450900,475200,null,null,null,null,null,null,null,"AMP060106      ","Valley Asphalt Corporation @ Cincinnati, OH"]
["00333 CL4 ASPH SURF 0.50A PG64-22",null,null,null,"6422","PG64-22",4,20525,0.75,0.5,"E","A","M236",null,null,null,null,null,null,null,null,null,null,null,null,null,378900,403200,427500,451800,476100,null,null,null,null,null,null,null,"AMP060310      ","Valley Asphalt Corporation @ Cleves, OH"]
["00334 CL3 ASPH SURF 0.38A PG64-22 (SLAG)",null,null,null,"6422","PG64-22",3,20500,0.5,0.38,"E","A","M347",null,null,null,null,null,null,null,null,null,null,null,null,null,379800,404100,428400,452700,477000,null,null,null,null,null,null,null,"AMPMP0301","HCC Mobile Plant 1"]
["00335 CL4 ASPH SURF 0.50A PG76-22",null,null,null,"7622",{"$f":"RIGHT(A130,7)","v":"PG76-22"},4,20525,0.75,0.5,"E","A","M240",null,null,null,null,null,null,null,null,null,null,null,null,null,380700,405000,429300,453600,477900,null,null,null,null,null,null,null,"AMP??????","Contractor & Loc. Not In Drop-Down List"]
["00336 CL3 ASPH SURF 0.38A PG76-22",null,null,null,"7622","PG76-22",3,20500,0.5,0.38,"E","A","M242",null,null,null,null,null,null,null,null,null,null,null,null,null,381600,405900,430200,454500,478800]
["00337 CL4 ASPH SURF 0.38B PG76-22",null,null,null,"7622","PG76-22",4,20500,0.5,0.38,"E","B","M244",null,null,null,null,null,null,null,null,null,null,null,null,null,382500,406800,431100,455400,479700]
["00339 CL3 ASPH SURF 0.38D PG64-22",null,null,null,"6422","PG64-22",3,20500,0.5,0.38,"E",null,"M246",null,null,null,null,null,null,null,null,null,null,null,null,null,383400,407700,432000,456300,480600]
["00340 CL2 ASPH SURF 0.38D PG76-22",null,null,null,"7622","PG76-22",2,20500,0.5,0.38,"E",null,"M248",null,null,null,null,null,null,null,null,null,null,null,null,null,384300,408600,432900,457200,481500]
["00342 CL4 ASPH SURF 0.38A PG76-22",null,null,null,"7622","PG76-22",4,20500,0.5,0.38,"E","A","M250",null,null,null,null,null,null,null,null,null,null,null,null,null,385200,409500,433800,458100,482400]
["00374 ASPH SURF SAND TY II PG64-22",null,null,null,"6422","PG64-22","N/A",20100,0.25,"SA TY II","E","A","M254",null,null,null,null,null,null,null,null,null,null,null,null,null,386100,410400,434700,459000,483300]
["00385 CL3 ASPH SURF 0.38A PG64-22",null,null,null,"6422","PG64-22",3,20500,0.5,0.38,"E","A","M334",null,null,null,null,null,null,null,null,null,null,null,null,null,387000,411300,435600,459900,484200]
["00386 CL3 ASPH SURF 0.38B PG64-22(SLAG)",null,null,null,"6422","PG64-22",3,20500,0.5,0.38,"E","B","M348",null,null,null,null,null,null,null,null,null,null,null,null,null,387900,412200,436500,460800,485100]
["00387 CL3 ASPH SURF 0.38B PG76-22",null,null,null,"7622","PG76-22",3,20500,0.5,0.38,"E","B","M339",null,null,null,null,null,null,null,null,null,null,null,null,null,388800,413100,437400,461700,486000]
["00388 CL3 ASPH SURF 0.38B PG64-22",null,null,null,"6422","PG64-22",3,20500,0.5,0.38,"E","B","M335"]
["00389 CL3 ASPH SURF 0.38D PG76-22",null,null,null,"7622","PG76-22",3,20500,0.5,0.38,"E",null,"M349",null,null,null,null,null,null,null,null,null,null,null,null,null,"102 - 2",{"$f":"CONCATENATE(LEFT(AA167,3)+1,\" - 1\")","v":"109 - 1"},{"$f":"CONCATENATE(LEFT(AB167,3),\" - 4\")","v":"115 - 4"},{"$f":"CONCATENATE(LEFT(AC167,3),\" - 3\")","v":"122 - 3"},{"$f":"CONCATENATE(LEFT(AD167,3),\" - 2\")","v":"129 - 2"}]
["00391 CL2 ASPH SURF 0.50B PG76-22",null,null,null,"7622","PG76-22",2,20525,0.5,0.38,"E","B","M357",null,null,null,null,null,null,null,null,null,null,null,null,null,{"$f":"CONCATENATE(LEFT(AA141,3),\" - 3\")","v":"102 - 3"},{"$f":"CONCATENATE(LEFT(AB141,3),\" - 2\")","v":"109 - 2"},{"$f":"CONCATENATE(LEFT(AC141,3)+1,\" - 1\")","v":"116 - 1"},{"$f":"CONCATENATE(LEFT(AD141,3),\" - 4\")","v":"122 - 4"},{"$f":"CONCATENATE(LEFT(AE141,3),\" - 3\")","v":"129 - 3"}]
["01897 ASPHALT WEDGE CURB",null,null,null,"6422","PG64-22","N/A",23025,0.5,0.38,"E",null,"M256",null,null,null,null,null,null,null,null,null,null,null,null,null,{"$f":"CONCATENATE(LEFT(AA142,3),\" - 4\")","v":"102 - 4"},{"$f":"CONCATENATE(LEFT(AB142,3),\" - 3\")","v":"109 - 3"},{"$f":"CONCATENATE(LEFT(AC142,3),\" - 2\")","v":"116 - 2"},{"$f":"CONCATENATE(LEFT(AD142,3)+1,\" - 1\")","v":"123 - 1"},{"$f":"CONCATENATE(LEFT(AE142,3),\" - 4\")","v":"129 - 4"}]
["01935 MOUNTABLE MEDIAN TYPE 1",null,null,null,"6422","PG64-22","N/A",23050,0.5,0.38,"E",null,"M258",null,null,null,null,null,null,null,null,null,null,null,null,null,{"$f":"CONCATENATE(LEFT(AA143,3)+1,\" - 1\")","v":"103 - 1"},{"$f":"CONCATENATE(LEFT(AB143,3),\" - 4\")","v":"109 - 4"},{"$f":"CONCATENATE(LEFT(AC143,3),\" - 3\")","v":"116 - 3"},{"$f":"CONCATENATE(LEFT(AD143,3),\" - 2\")","v":"123 - 2"},{"$f":"CONCATENATE(LEFT(AE143,3)+1,\" - 1\")","v":"130 - 1"}]
["01936 MOUNTABLE MEDIAN TYPE 1 MOD",null,null,null,"6422","PG64-22","N/A",23050,0.5,0.38,"E",null,"M260",null,null,null,null,null,null,null,null,null,null,null,null,null,{"$f":"CONCATENATE(LEFT(AA144,3),\" - 2\")","v":"103 - 2"},{"$f":"CONCATENATE(LEFT(AB144,3)+1,\" - 1\")","v":"110 - 1"},{"$f":"CONCATENATE(LEFT(AC144,3),\" - 4\")","v":"116 - 4"},{"$f":"CONCATENATE(LEFT(AD144,3),\" - 3\")","v":"123 - 3"},{"$f":"CONCATENATE(LEFT(AE144,3),\" - 2\")","v":"130 - 2"}]
["01937 MOUNTABLE MEDIAN TYPE 2",null,null,null,"6422","PG64-22","N/A",23050,0.5,0.38,"E",null,"M262",null,null,null,null,null,null,null,null,null,null,null,null,null,{"$f":"CONCATENATE(LEFT(AA145,3),\" - 3\")","v":"103 - 3"},{"$f":"CONCATENATE(LEFT(AB145,3),\" - 2\")","v":"110 - 2"},{"$f":"CONCATENATE(LEFT(AC145,3)+1,\" - 1\")","v":"117 - 1"},{"$f":"CONCATENATE(LEFT(AD145,3),\" - 4\")","v":"123 - 4"},{"$f":"CONCATENATE(LEFT(AE145,3),\" - 3\")","v":"130 - 3"}]
["01939 MOUNTABLE MEDIAN TYPE 3",null,null,null,"6422","PG64-22","N/A",23050,0.5,0.38,"E",null,"M264",null,null,null,null,null,null,null,null,null,null,null,null,null,{"$f":"CONCATENATE(LEFT(AA146,3),\" - 4\")","v":"103 - 4"},{"$f":"CONCATENATE(LEFT(AB146,3),\" - 3\")","v":"110 - 3"},{"$f":"CONCATENATE(LEFT(AC146,3),\" - 2\")","v":"117 - 2"},{"$f":"CONCATENATE(LEFT(AD146,3)+1,\" - 1\")","v":"124 - 1"},{"$f":"CONCATENATE(LEFT(AE146,3),\" - 4\")","v":"130 - 4"}]
["01940 MOUNTABLE MEDIAN TYPE 3 MOD",null,null,null,"6422","PG64-22","N/A",23050,0.5,0.38,"E",null,"M266",null,null,null,null,null,null,null,null,null,null,null,null,null,{"$f":"CONCATENATE(LEFT(AA147,3)+1,\" - 1\")","v":"104 - 1"},{"$f":"CONCATENATE(LEFT(AB147,3),\" - 4\")","v":"110 - 4"},{"$f":"CONCATENATE(LEFT(AC147,3),\" - 3\")","v":"117 - 3"},{"$f":"CONCATENATE(LEFT(AD147,3),\" - 2\")","v":"124 - 2"},{"$f":"CONCATENATE(LEFT(AE147,3)+1,\" - 1\")","v":"131 - 1"}]
["01941 MOUNTABLE MEDIAN TYPE 4",null,null,null,"6422","PG64-22","N/A",23050,0.5,0.38,"E",null,"M268",null,null,null,null,null,null,null,null,null,null,null,null,null,{"$f":"CONCATENATE(LEFT(AA148,3),\" - 2\")","v":"104 - 2"},{"$f":"CONCATENATE(LEFT(AB148,3)+1,\" - 1\")","v":"111 - 1"},{"$f":"CONCATENATE(LEFT(AC148,3),\" - 4\")","v":"117 - 4"},{"$f":"CONCATENATE(LEFT(AD148,3),\" - 3\")","v":"124 - 3"},{"$f":"CONCATENATE(LEFT(AE148,3),\" - 2\")","v":"131 - 2"}]
["01943 MOUNTABLE MEDIAN TYPE 5",null,null,null,"6422","PG64-22","N/A",23050,0.5,0.38,"E",null,"M270",null,null,null,null,null,null,null,null,null,null,null,null,null,{"$f":"CONCATENATE(LEFT(AA149,3),\" - 3\")","v":"104 - 3"},{"$f":"CONCATENATE(LEFT(AB149,3),\" - 2\")","v":"111 - 2"},{"$f":"CONCATENATE(LEFT(AC149,3)+1,\" - 1\")","v":"118 - 1"},{"$f":"CONCATENATE(LEFT(AD149,3),\" - 4\")","v":"124 - 4"},{"$f":"CONCATENATE(LEFT(AE149,3),\" - 3\")","v":"131 - 3"}]
["01945 MOUNTABLE MEDIAN TYPE 1A",null,null,null,"6422","PG64-22","N/A",23050,0.5,0.38,"E",null,"M272",null,null,null,null,null,null,null,null,null,null,null,null,null,{"$f":"CONCATENATE(LEFT(AA150,3),\" - 4\")","v":"104 - 4"},{"$f":"CONCATENATE(LEFT(AB150,3),\" - 3\")","v":"111 - 3"},{"$f":"CONCATENATE(LEFT(AC150,3),\" - 2\")","v":"118 - 2"},{"$f":"CONCATENATE(LEFT(AD150,3)+1,\" - 1\")","v":"125 - 1"},{"$f":"CONCATENATE(LEFT(AE150,3),\" - 4\")","v":"131 - 4"}]
["01946 MOUNTABLE MEDIAN TYPE 2A",null,null,null,"6422","PG64-22","N/A",23050,0.5,0.38,"E",null,"M274",null,null,null,null,null,null,null,null,null,null,null,null,null,{"$f":"CONCATENATE(LEFT(AA151,3)+1,\" - 1\")","v":"105 - 1"},{"$f":"CONCATENATE(LEFT(AB151,3),\" - 4\")","v":"111 - 4"},{"$f":"CONCATENATE(LEFT(AC151,3),\" - 3\")","v":"118 - 3"},{"$f":"CONCATENATE(LEFT(AD151,3),\" - 2\")","v":"125 - 2"},{"$f":"CONCATENATE(LEFT(AE151,3)+1,\" - 1\")","v":"132 - 1"}]
["01947 MOUNTABLE MEDIAN TYPE 3A",null,null,null,"6422","PG64-22","N/A",23050,0.5,0.38,"E",null,"M276",null,null,null,null,null,null,null,null,null,null,null,null,null,{"$f":"CONCATENATE(LEFT(AA152,3),\" - 2\")","v":"105 - 2"},{"$f":"CONCATENATE(LEFT(AB152,3)+1,\" - 1\")","v":"112 - 1"},{"$f":"CONCATENATE(LEFT(AC152,3),\" - 4\")","v":"118 - 4"},{"$f":"CONCATENATE(LEFT(AD152,3),\" - 3\")","v":"125 - 3"},{"$f":"CONCATENATE(LEFT(AE152,3),\" - 2\")","v":"132 - 2"}]
["01949 MOUNTABLE MEDIAN TYPE 6A",null,null,null,"6422","PG64-22","N/A",23050,0.5,0.38,"E",null,"M278",null,null,null,null,null,null,null,null,null,null,null,null,null,{"$f":"CONCATENATE(LEFT(AA153,3),\" - 3\")","v":"105 - 3"},{"$f":"CONCATENATE(LEFT(AB153,3),\" - 2\")","v":"112 - 2"},{"$f":"CONCATENATE(LEFT(AC153,3)+1,\" - 1\")","v":"119 - 1"},{"$f":"CONCATENATE(LEFT(AD153,3),\" - 4\")","v":"125 - 4"},{"$f":"CONCATENATE(LEFT(AE153,3),\" - 3\")","v":"132 - 3"}]
["01950 MOUNTABLE MEDIAN TYPE 7A",null,null,null,"6422","PG64-22","N/A",23050,0.5,0.38,"E",null,"M280",null,null,null,null,null,null,null,null,null,null,null,null,null,{"$f":"CONCATENATE(LEFT(AA154,3),\" - 4\")","v":"105 - 4"},{"$f":"CONCATENATE(LEFT(AB154,3),\" - 3\")","v":"112 - 3"},{"$f":"CONCATENATE(LEFT(AC154,3),\" - 2\")","v":"119 - 2"},{"$f":"CONCATENATE(LEFT(AD154,3)+1,\" - 1\")","v":"126 - 1"},{"$f":"CONCATENATE(LEFT(AE154,3),\" - 4\")","v":"132 - 4"}]
["00101 SAMI",null,null,null,"N/A","CRS-2P","N/A",22100,0.5,0.38,"E",null,"M288",null,null,null,null,null,null,null,null,null,null,null,null,null,{"$f":"CONCATENATE(LEFT(AA155,3)+1,\" - 1\")","v":"106 - 1"},{"$f":"CONCATENATE(LEFT(AB155,3),\" - 4\")","v":"112 - 4"},{"$f":"CONCATENATE(LEFT(AC155,3),\" - 3\")","v":"119 - 3"},{"$f":"CONCATENATE(LEFT(AD155,3),\" - 2\")","v":"126 - 2"},{"$f":"CONCATENATE(LEFT(AE155,3)+1,\" - 1\")","v":"133 - 1"}]
["21683ES400 CL2 ASPH BASE 0.75D PG76-22",null,null,null,"7622","PG76-22",2,20575,1,0.75,"E",null,"M317",null,null,null,null,null,null,null,null,null,null,null,null,null,{"$f":"CONCATENATE(LEFT(AA156,3),\" - 2\")","v":"106 - 2"},{"$f":"CONCATENATE(LEFT(AB156,3)+1,\" - 1\")","v":"113 - 1"},{"$f":"CONCATENATE(LEFT(AC156,3),\" - 4\")","v":"119 - 4"},{"$f":"CONCATENATE(LEFT(AD156,3),\" - 3\")","v":"126 - 3"},{"$f":"CONCATENATE(LEFT(AE156,3),\" - 2\")","v":"133 - 2"}]
["20696ES403 CL2 ASPH BASE 1.0D PG76-22",null,null,null,"7622","PG76-22",2,20600,1.5,1,"E",null,"M294",null,null,null,null,null,null,null,null,null,null,null,null,null,{"$f":"CONCATENATE(LEFT(AA157,3),\" - 3\")","v":"106 - 3"},{"$f":"CONCATENATE(LEFT(AB157,3),\" - 2\")","v":"113 - 2"},{"$f":"CONCATENATE(LEFT(AC157,3)+1,\" - 1\")","v":"120 - 1"},{"$f":"CONCATENATE(LEFT(AD157,3),\" - 4\")","v":"126 - 4"},{"$f":"CONCATENATE(LEFT(AE157,3),\" - 3\")","v":"133 - 3"}]
["20761ES403 CL2 ASPH SURF 0.38D PG64-22(SLAG)",null,null,null,"6422","PG64-22",2,20500,0.5,0.38,"E",null,"M303",null,null,null,null,null,null,null,null,null,null,null,null,null,{"$f":"CONCATENATE(LEFT(AA158,3),\" - 4\")","v":"106 - 4"},{"$f":"CONCATENATE(LEFT(AB158,3),\" - 3\")","v":"113 - 3"},{"$f":"CONCATENATE(LEFT(AC158,3),\" - 2\")","v":"120 - 2"},{"$f":"CONCATENATE(LEFT(AD158,3)+1,\" - 1\")","v":"127 - 1"},{"$f":"CONCATENATE(LEFT(AE158,3),\" - 4\")","v":"133 - 4"}]
["24887EC CL3 ASPH SURF NO.4A PG64-22",null,null,null,"6422","PG64-22",3,20490,0.38,"NO. 4","E","A","M352",null,null,null,null,null,null,null,null,null,null,null,null,null,{"$f":"CONCATENATE(LEFT(AA159,3)+1,\" - 1\")","v":"107 - 1"},{"$f":"CONCATENATE(LEFT(AB159,3),\" - 4\")","v":"113 - 4"},{"$f":"CONCATENATE(LEFT(AC159,3),\" - 3\")","v":"120 - 3"},{"$f":"CONCATENATE(LEFT(AD159,3),\" - 2\")","v":"127 - 2"},{"$f":"CONCATENATE(LEFT(AE159,3)+1,\" - 1\")","v":"134 - 1"}]
["23307EC CL3 ASPH SURF NO.4B PG64-22",null,null,null,"6422","PG64-22",3,20490,0.38,"NO. 4","E","B","M353",null,null,null,null,null,null,null,null,null,null,null,null,null,{"$f":"CONCATENATE(LEFT(AA160,3),\" - 2\")","v":"107 - 2"},{"$f":"CONCATENATE(LEFT(AB160,3)+1,\" - 1\")","v":"114 - 1"},{"$f":"CONCATENATE(LEFT(AC160,3),\" - 4\")","v":"120 - 4"},{"$f":"CONCATENATE(LEFT(AD160,3),\" - 3\")","v":"127 - 3"},{"$f":"CONCATENATE(LEFT(AE160,3),\" - 2\")","v":"134 - 2"}]
["24570EC CL3 ASPH SURF NO.4D PG64-22",null,null,null,"6422","PG64-22",3,20490,0.38,"NO. 4","E",null,"M354",null,null,null,null,null,null,null,null,null,null,null,null,null,{"$f":"CONCATENATE(LEFT(AA161,3),\" - 3\")","v":"107 - 3"},{"$f":"CONCATENATE(LEFT(AB161,3),\" - 2\")","v":"114 - 2"},{"$f":"CONCATENATE(LEFT(AC161,3)+1,\" - 1\")","v":"121 - 1"},{"$f":"CONCATENATE(LEFT(AD161,3),\" - 4\")","v":"127 - 4"},{"$f":"CONCATENATE(LEFT(AE161,3),\" - 3\")","v":"134 - 3"}]
["24888ED CL2 ASPH SURF NO.4B PG64-22",null,null,null,"6422","PG64-22",2,20490,0.38,"NO. 4","E","B","M355",null,null,null,null,null,null,null,null,null,null,null,null,null,{"$f":"CONCATENATE(LEFT(AA162,3),\" - 4\")","v":"107 - 4"},{"$f":"CONCATENATE(LEFT(AB162,3),\" - 3\")","v":"114 - 3"},{"$f":"CONCATENATE(LEFT(AC162,3),\" - 2\")","v":"121 - 2"},{"$f":"CONCATENATE(LEFT(AD162,3)+1,\" - 1\")","v":"128 - 1"},{"$f":"CONCATENATE(LEFT(AE162,3),\" - 4\")","v":"134 - 4"}]
["25077EC CL4 ASPH SURF NO.4A PG64-22",null,null,null,"6422","PG64-22",4,20490,0.38,"NO. 4","E","A","M361",null,null,null,null,null,null,null,null,null,null,null,null,null,{"$f":"CONCATENATE(LEFT(AA163,3)+1,\" - 1\")","v":"108 - 1"},{"$f":"CONCATENATE(LEFT(AB163,3),\" - 4\")","v":"114 - 4"},{"$f":"CONCATENATE(LEFT(AC163,3),\" - 3\")","v":"121 - 3"},{"$f":"CONCATENATE(LEFT(AD163,3),\" - 2\")","v":"128 - 2"},{"$f":"CONCATENATE(LEFT(AE163,3)+1,\" - 1\")","v":"135 - 1"}]
["21653ES403 CL2 ASPH SURF NO.4D PG64-22",null,null,null,"6422","PG64-22",2,20490,0.38,"NO. 4","E",null,"M311",null,null,null,null,null,null,null,null,null,null,null,null,null,{"$f":"CONCATENATE(LEFT(AA164,3),\" - 2\")","v":"108 - 2"},{"$f":"CONCATENATE(LEFT(AB164,3)+1,\" - 1\")","v":"115 - 1"},{"$f":"CONCATENATE(LEFT(AC164,3),\" - 4\")","v":"121 - 4"},{"$f":"CONCATENATE(LEFT(AD164,3),\" - 3\")","v":"128 - 3"},{"$f":"CONCATENATE(LEFT(AE164,3),\" - 2\")","v":"135 - 2"}]
["22906ES403 CL3 ASPH SURF 0.38A PG64-22",null,null,null,"6422","PG64-22",3,20500,0.5,0.38,"E","A","M332",null,null,null,null,null,null,null,null,null,null,null,null,null,{"$f":"CONCATENATE(LEFT(AA165,3),\" - 3\")","v":"108 - 3"},{"$f":"CONCATENATE(LEFT(AB165,3),\" - 2\")","v":"115 - 2"},{"$f":"CONCATENATE(LEFT(AC165,3)+1,\" - 1\")","v":"122 - 1"},{"$f":"CONCATENATE(LEFT(AD165,3),\" - 4\")","v":"128 - 4"},{"$f":"CONCATENATE(LEFT(AE165,3),\" - 3\")","v":"135 - 3"}]
["20469ES403 CL3 ASPH SURF 0.38B PG76-22",null,null,null,"7622","PG76-22",3,20500,0.5,0.38,"E","B","M291",null,null,null,null,null,null,null,null,null,null,null,null,null,{"$f":"CONCATENATE(LEFT(AA166,3),\" - 4\")","v":"108 - 4"},{"$f":"CONCATENATE(LEFT(AB166,3),\" - 3\")","v":"115 - 3"},{"$f":"CONCATENATE(LEFT(AC166,3),\" - 2\")","v":"122 - 2"},{"$f":"CONCATENATE(LEFT(AD166,3)+1,\" - 1\")","v":"129 - 1"},{"$f":"CONCATENATE(LEFT(AE166,3),\" - 4\")","v":"135 - 4"}]
["23128ES403 CL4 ASPH SURF 0.38A PG64-22",null,null,null,"6422","PG64-22",4,20500,0.5,0.38,"E","A","M336"]
["23142ES403 CL4 ASPH SURF 0.38B PG64-22",null,null,null,"6422","PG64-22",4,20500,0.5,0.38,"E","B","M337",null,null,null,null,null,null,null,null,null,null,null,null,null,{"$f":"IF($K$48=\"E\",AE139+1000,AE139+900)","v":486900},{"$f":"IF($K$48=\"E\",AA195+1000,AA195+900)","v":511200},{"$f":"IF($K$48=\"E\",AB195+1000,AB195+900)","v":535500},{"$f":"IF($K$48=\"E\",AC195+1000,AC195+900)","v":559800},{"$f":"IF($K$48=\"E\",AD195+1000,AD195+900)","v":584100}]
["21001ES400 CL4 ASPH SURF 0.38D PG64-22",null,null,null,"6422","PG64-22",4,20500,0.5,0.38,"E",null,"M329",null,null,null,null,null,null,null,null,null,null,null,null,null,{"$f":"IF($K$48=\"E\",AA169+1000,AA169+900)","v":487800},{"$f":"IF($K$48=\"E\",AB169+1000,AB169+900)","v":512100},{"$f":"IF($K$48=\"E\",AC169+1000,AC169+900)","v":536400},{"$f":"IF($K$48=\"E\",AD169+1000,AD169+900)","v":560700},{"$f":"IF($K$48=\"E\",AE169+1000,AE169+900)","v":585000}]
["23647ES400 CL2 ASPH SURF 0.5A PG 64-22",null,null,null,"6422","PG64-22",2,20525,0.75,0.5,"E","A","M340",null,null,null,null,null,null,null,null,null,null,null,null,null,488700,513000,537300,561600,585900]
["23362ES403 CL2 ASPH SURF 0.5B PG 64-22",null,null,null,"6422","PG64-22",2,20525,0.75,0.5,"E","B","M341",null,null,null,null,null,null,null,null,null,null,null,null,null,489600,513900,538200,562500,586800]
["23165ES403 CL3 ASPH SURF 0.5B PG64-22",null,null,null,"6422","PG64-22",3,20525,0.75,0.5,"E","B","M342",null,null,null,null,null,null,null,null,null,null,null,null,null,490500,514800,539100,563400,587700]
["23176ES403 CL4 ASPH SURF 0.5A PG76-22",null,null,null,"7622","PG76-22",4,20525,0.75,0.5,"E","A","M343",null,null,null,null,null,null,null,null,null,null,null,null,null,491400,515700,540000,564300,588600]
["23307EC CL3 ASPH SURF NO.4B PG64-22",null,null,null,6422,"PG64-22",3,20490,0.38,"NO. 4","E","B","M350",null,null,null,null,null,null,null,null,null,null,null,null,null,492300,516600,540900,565200,589500]
["24177ES400 CL2 ASPH BASE 0.75D PG64-22-SLAG",null,null,null,6422,"PG64-22",2,20575,1,0.75,"E",null,"M351",null,null,null,null,null,null,null,null,null,null,null,null,null,493200,517500,541800,566100,590400]
["Bid Item Not In Drop-Down List",null,null,null,null,null,null,{"$f":"IF(J177=0.38,20500,IF(J177=0.5,20525,IF(J177=0.75,20575,IF(J177=1,20600,IF(J177=1.5,20625,\"\")))))","v":""},{"$f":"IF(J177=0.38,0.5,IF(J177=0.5,0.75,IF(J177=0.75,1,IF(J177=1,1.5,IF(J177=1.5,2,\"\")))))","v":""},null,null,null,null,null,null,null,null,null,null,null,null,null,null,null,null,null,494100,518400,542700,567000,591300]
[null,null,null,null,null,null,null,null,null,null,null,null,null,null,null,null,null,null,null,null,null,null,null,null,null,null,495000,519300,543600,567900,592200]
[null,null,null,null,null,null,null,null,null,null,null,null,null,null,null,null,null,null,null,null,null,null,null,null,null,null,495900,520200,544500,568800,593100]
[null,null,null,null,null,null,null,null,null,null,null,null,null,null,null,null,null,null,null,null,null,null,null,null,null,null,496800,521100,545400,569700,594000]
[null,null,null,null,null,null,null,null,null,null,null,null,null,null,null,null,null,null,null,null,null,null,null,null,null,null,497700,522000,546300,570600,594900]
[null,null,null,null,null,null,null,null,null,null,null,null,null,null,null,null,null,null,null,null,null,null,null,null,null,null,498600,522900,547200,571500,595800]
[null,null,null,null,null,null,null,null,null,null,null,null,null,null,null,null,null,null,null,null,null,null,null,null,null,null,499500,523800,548100,572400,596700]
[null,null,null,null,null,null,null,null,null,null,null,null,null,null,null,null,null,null,null,null,null,null,null,null,null,null,500400,524700,549000,573300,597600]
[null,null,null,null,null,null,null,null,null,null,null,null,null,null,null,null,null,null,null,null,null,null,null,null,null,null,501300,525600,549900,574200,598500]
[null,null,null,null,null,null,null,null,null,null,null,null,null,null,null,null,null,null,null,null,null,null,null,null,null,null,502200,526500,550800,575100,599400]
[null,null,null,null,null,null,null,null,null,null,null,null,null,null,null,null,null,null,null,null,null,null,null,null,null,null,503100,527400,551700,576000,600300]
[null,null,null,null,null,null,null,null,null,null,null,null,null,null,null,null,null,null,null,null,null,null,null,null,null,null,504000,528300,552600,576900,601200]
[null,null,null,null,null,null,null,null,null,null,null,null,null,null,null,null,null,null,null,null,null,null,null,null,null,null,504900,529200,553500,577800,602100]
[null,null,null,null,null,null,null,null,null,null,null,null,null,null,null,null,null,null,null,null,null,null,null,null,null,null,505800,530100,554400,578700,603000]
[null,null,null,null,null,null,null,null,null,null,null,null,null,null,null,null,null,null,null,null,null,null,null,null,null,null,506700,531000,555300,579600,603900]
[null,null,null,null,null,null,null,null,null,null,null,null,null,null,null,null,null,null,null,null,null,null,null,null,null,null,507600,531900,556200,580500,604800]
[null,null,null,null,null,null,null,null,null,null,null,null,null,null,null,null,null,null,null,null,null,null,null,null,null,null,508500,532800,557100,581400,605700]
[null,null,null,null,null,null,null,null,null,null,null,null,null,null,null,null,null,null,null,null,null,null,null,null,null,null,509400,533700,558000,582300,606600]
[null,null,null,null,null,null,null,null,null,null,null,null,null,null,null,null,null,null,null,null,null,null,null,null,null,null,510300,534600,558900,583200,607500]
[]
[null,null,null,null,null,null,null,null,null,null,null,null,null,null,null,null,null,null,null,null,null,null,null,null,null,null,"136 - 1",{"$f":"CONCATENATE(LEFT(AA223,3),\" - 4\")","v":"142 - 4"},{"$f":"CONCATENATE(LEFT(AB223,3),\" - 3\")","v":"149 - 3"},{"$f":"CONCATENATE(LEFT(AC223,3),\" - 2\")","v":"156 - 2"},{"$f":"CONCATENATE(LEFT(AD223,3)+1,\" - 1\")","v":"163 - 1"}]
[null,null,null,null,null,null,null,null,null,null,null,null,null,null,null,null,null,null,null,null,null,null,null,null,null,null,{"$f":"CONCATENATE(LEFT(AA197,3),\" - 2\")","v":"136 - 2"},{"$f":"CONCATENATE(LEFT(AB197,3)+1,\" - 1\")","v":"143 - 1"},{"$f":"CONCATENATE(LEFT(AC197,3),\" - 4\")","v":"149 - 4"},{"$f":"CONCATENATE(LEFT(AD197,3),\" - 3\")","v":"156 - 3"},{"$f":"CONCATENATE(LEFT(AE197,3),\" - 2\")","v":"163 - 2"}]
[null,null,null,null,null,null,null,null,null,null,null,null,null,null,null,null,null,null,null,null,null,null,null,null,null,null,{"$f":"CONCATENATE(LEFT(AA198,3),\" - 3\")","v":"136 - 3"},{"$f":"CONCATENATE(LEFT(AB198,3),\" - 2\")","v":"143 - 2"},{"$f":"CONCATENATE(LEFT(AC198,3)+1,\" - 1\")","v":"150 - 1"},{"$f":"CONCATENATE(LEFT(AD198,3),\" - 4\")","v":"156 - 4"},{"$f":"CONCATENATE(LEFT(AE198,3),\" - 3\")","v":"163 - 3"}]
[null,null,null,null,null,null,null,null,null,null,null,null,null,null,null,null,null,null,null,null,null,null,null,null,null,null,{"$f":"CONCATENATE(LEFT(AA199,3),\" - 4\")","v":"136 - 4"},{"$f":"CONCATENATE(LEFT(AB199,3),\" - 3\")","v":"143 - 3"},{"$f":"CONCATENATE(LEFT(AC199,3),\" - 2\")","v":"150 - 2"},{"$f":"CONCATENATE(LEFT(AD199,3)+1,\" - 1\")","v":"157 - 1"},{"$f":"CONCATENATE(LEFT(AE199,3),\" - 4\")","v":"163 - 4"}]
[null,null,null,null,null,null,null,null,null,null,null,null,null,null,null,null,null,null,null,null,null,null,null,null,null,null,{"$f":"CONCATENATE(LEFT(AA200,3)+1,\" - 1\")","v":"137 - 1"},{"$f":"CONCATENATE(LEFT(AB200,3),\" - 4\")","v":"143 - 4"},{"$f":"CONCATENATE(LEFT(AC200,3),\" - 3\")","v":"150 - 3"},{"$f":"CONCATENATE(LEFT(AD200,3),\" - 2\")","v":"157 - 2"},{"$f":"CONCATENATE(LEFT(AE200,3)+1,\" - 1\")","v":"164 - 1"}]
[null,null,null,null,null,null,null,null,null,null,null,null,null,null,null,null,null,null,null,null,null,null,null,null,null,null,{"$f":"CONCATENATE(LEFT(AA201,3),\" - 2\")","v":"137 - 2"},{"$f":"CONCATENATE(LEFT(AB201,3)+1,\" - 1\")","v":"144 - 1"},{"$f":"CONCATENATE(LEFT(AC201,3),\" - 4\")","v":"150 - 4"},{"$f":"CONCATENATE(LEFT(AD201,3),\" - 3\")","v":"157 - 3"},{"$f":"CONCATENATE(LEFT(AE201,3),\" - 2\")","v":"164 - 2"}]
[null,null,null,null,null,null,null,null,null,null,null,null,null,null,null,null,null,null,null,null,null,null,null,null,null,null,{"$f":"CONCATENATE(LEFT(AA202,3),\" - 3\")","v":"137 - 3"},{"$f":"CONCATENATE(LEFT(AB202,3),\" - 2\")","v":"144 - 2"},{"$f":"CONCATENATE(LEFT(AC202,3)+1,\" - 1\")","v":"151 - 1"},{"$f":"CONCATENATE(LEFT(AD202,3),\" - 4\")","v":"157 - 4"},{"$f":"CONCATENATE(LEFT(AE202,3),\" - 3\")","v":"164 - 3"}]
[null,null,null,null,null,null,null,null,null,null,null,null,null,null,null,null,null,null,null,null,null,null,null,null,null,null,{"$f":"CONCATENATE(LEFT(AA203,3),\" - 4\")","v":"137 - 4"},{"$f":"CONCATENATE(LEFT(AB203,3),\" - 3\")","v":"144 - 3"},{"$f":"CONCATENATE(LEFT(AC203,3),\" - 2\")","v":"151 - 2"},{"$f":"CONCATENATE(LEFT(AD203,3)+1,\" - 1\")","v":"158 - 1"},{"$f":"CONCATENATE(LEFT(AE203,3),\" - 4\")","v":"164 - 4"}]
[null,null,null,null,null,null,null,null,null,null,null,null,null,null,null,null,null,null,null,null,null,null,null,null,null,null,{"$f":"CONCATENATE(LEFT(AA204,3)+1,\" - 1\")","v":"138 - 1"},{"$f":"CONCATENATE(LEFT(AB204,3),\" - 4\")","v":"144 - 4"},{"$f":"CONCATENATE(LEFT(AC204,3),\" - 3\")","v":"151 - 3"},{"$f":"CONCATENATE(LEFT(AD204,3),\" - 2\")","v":"158 - 2"},{"$f":"CONCATENATE(LEFT(AE204,3)+1,\" - 1\")","v":"165 - 1"}]
[null,null,null,null,null,null,null,null,null,null,null,null,null,null,null,null,null,null,null,null,null,null,null,null,null,null,{"$f":"CONCATENATE(LEFT(AA205,3),\" - 2\")","v":"138 - 2"},{"$f":"CONCATENATE(LEFT(AB205,3)+1,\" - 1\")","v":"145 - 1"},{"$f":"CONCATENATE(LEFT(AC205,3),\" - 4\")","v":"151 - 4"},{"$f":"CONCATENATE(LEFT(AD205,3),\" - 3\")","v":"158 - 3"},{"$f":"CONCATENATE(LEFT(AE205,3),\" - 2\")","v":"165 - 2"}]
[null,null,null,null,null,null,null,null,null,null,null,null,null,null,null,null,null,null,null,null,null,null,null,null,null,null,{"$f":"CONCATENATE(LEFT(AA206,3),\" - 3\")","v":"138 - 3"},{"$f":"CONCATENATE(LEFT(AB206,3),\" - 2\")","v":"145 - 2"},{"$f":"CONCATENATE(LEFT(AC206,3)+1,\" - 1\")","v":"152 - 1"},{"$f":"CONCATENATE(LEFT(AD206,3),\" - 4\")","v":"158 - 4"},{"$f":"CONCATENATE(LEFT(AE206,3),\" - 3\")","v":"165 - 3"}]
[null,null,null,null,null,null,null,null,null,null,null,null,null,null,null,null,null,null,null,null,null,null,null,null,null,null,{"$f":"CONCATENATE(LEFT(AA207,3),\" - 4\")","v":"138 - 4"},{"$f":"CONCATENATE(LEFT(AB207,3),\" - 3\")","v":"145 - 3"},{"$f":"CONCATENATE(LEFT(AC207,3),\" - 2\")","v":"152 - 2"},{"$f":"CONCATENATE(LEFT(AD207,3)+1,\" - 1\")","v":"159 - 1"},{"$f":"CONCATENATE(LEFT(AE207,3),\" - 4\")","v":"165 - 4"}]
[null,null,null,null,null,null,null,null,null,null,null,null,null,null,null,null,null,null,null,null,null,null,null,null,null,null,{"$f":"CONCATENATE(LEFT(AA208,3)+1,\" - 1\")","v":"139 - 1"},{"$f":"CONCATENATE(LEFT(AB208,3),\" - 4\")","v":"145 - 4"},{"$f":"CONCATENATE(LEFT(AC208,3),\" - 3\")","v":"152 - 3"},{"$f":"CONCATENATE(LEFT(AD208,3),\" - 2\")","v":"159 - 2"},{"$f":"CONCATENATE(LEFT(AE208,3)+1,\" - 1\")","v":"166 - 1"}]
[null,null,null,null,null,null,null,null,null,null,null,null,null,null,null,null,null,null,null,null,null,null,null,null,null,null,{"$f":"CONCATENATE(LEFT(AA209,3),\" - 2\")","v":"139 - 2"},{"$f":"CONCATENATE(LEFT(AB209,3)+1,\" - 1\")","v":"146 - 1"},{"$f":"CONCATENATE(LEFT(AC209,3),\" - 4\")","v":"152 - 4"},{"$f":"CONCATENATE(LEFT(AD209,3),\" - 3\")","v":"159 - 3"},{"$f":"CONCATENATE(LEFT(AE209,3),\" - 2\")","v":"166 - 2"}]
[null,null,null,null,null,null,null,null,null,null,null,null,null,null,null,null,null,null,null,null,null,null,null,null,null,null,{"$f":"CONCATENATE(LEFT(AA210,3),\" - 3\")","v":"139 - 3"},{"$f":"CONCATENATE(LEFT(AB210,3),\" - 2\")","v":"146 - 2"},{"$f":"CONCATENATE(LEFT(AC210,3)+1,\" - 1\")","v":"153 - 1"},{"$f":"CONCATENATE(LEFT(AD210,3),\" - 4\")","v":"159 - 4"},{"$f":"CONCATENATE(LEFT(AE210,3),\" - 3\")","v":"166 - 3"}]
[null,null,null,null,null,null,null,null,null,null,null,null,null,null,null,null,null,null,null,null,null,null,null,null,null,null,{"$f":"CONCATENATE(LEFT(AA211,3),\" - 4\")","v":"139 - 4"},{"$f":"CONCATENATE(LEFT(AB211,3),\" - 3\")","v":"146 - 3"},{"$f":"CONCATENATE(LEFT(AC211,3),\" - 2\")","v":"153 - 2"},{"$f":"CONCATENATE(LEFT(AD211,3)+1,\" - 1\")","v":"160 - 1"},{"$f":"CONCATENATE(LEFT(AE211,3),\" - 4\")","v":"166 - 4"}]
[null,null,null,null,null,null,null,null,null,null,null,null,null,null,null,null,null,null,null,null,null,null,null,null,null,null,{"$f":"CONCATENATE(LEFT(AA212,3)+1,\" - 1\")","v":"140 - 1"},{"$f":"CONCATENATE(LEFT(AB212,3),\" - 4\")","v":"146 - 4"},{"$f":"CONCATENATE(LEFT(AC212,3),\" - 3\")","v":"153 - 3"},{"$f":"CONCATENATE(LEFT(AD212,3),\" - 2\")","v":"160 - 2"},{"$f":"CONCATENATE(LEFT(AE212,3)+1,\" - 1\")","v":"167 - 1"}]
[null,null,null,null,null,null,null,null,null,null,null,null,null,null,null,null,null,null,null,null,null,null,null,null,null,null,{"$f":"CONCATENATE(LEFT(AA213,3),\" - 2\")","v":"140 - 2"},{"$f":"CONCATENATE(LEFT(AB213,3)+1,\" - 1\")","v":"147 - 1"},{"$f":"CONCATENATE(LEFT(AC213,3),\" - 4\")","v":"153 - 4"},{"$f":"CONCATENATE(LEFT(AD213,3),\" - 3\")","v":"160 - 3"},{"$f":"CONCATENATE(LEFT(AE213,3),\" - 2\")","v":"167 - 2"}]
[null,null,null,null,null,null,null,null,null,null,null,null,null,null,null,null,null,null,null,null,null,null,null,null,null,null,{"$f":"CONCATENATE(LEFT(AA214,3),\" - 3\")","v":"140 - 3"},{"$f":"CONCATENATE(LEFT(AB214,3),\" - 2\")","v":"147 - 2"},{"$f":"CONCATENATE(LEFT(AC214,3)+1,\" - 1\")","v":"154 - 1"},{"$f":"CONCATENATE(LEFT(AD214,3),\" - 4\")","v":"160 - 4"},{"$f":"CONCATENATE(LEFT(AE214,3),\" - 3\")","v":"167 - 3"}]
[null,null,null,null,null,null,null,null,null,null,null,null,null,null,null,null,null,null,null,null,null,null,null,null,null,null,{"$f":"CONCATENATE(LEFT(AA215,3),\" - 4\")","v":"140 - 4"},{"$f":"CONCATENATE(LEFT(AB215,3),\" - 3\")","v":"147 - 3"},{"$f":"CONCATENATE(LEFT(AC215,3),\" - 2\")","v":"154 - 2"},{"$f":"CONCATENATE(LEFT(AD215,3)+1,\" - 1\")","v":"161 - 1"},{"$f":"CONCATENATE(LEFT(AE215,3),\" - 4\")","v":"167 - 4"}]
[null,null,null,null,null,null,null,null,null,null,null,null,null,null,null,null,null,null,null,null,null,null,null,null,null,null,{"$f":"CONCATENATE(LEFT(AA216,3)+1,\" - 1\")","v":"141 - 1"},{"$f":"CONCATENATE(LEFT(AB216,3),\" - 4\")","v":"147 - 4"},{"$f":"CONCATENATE(LEFT(AC216,3),\" - 3\")","v":"154 - 3"},{"$f":"CONCATENATE(LEFT(AD216,3),\" - 2\")","v":"161 - 2"},{"$f":"CONCATENATE(LEFT(AE216,3)+1,\" - 1\")","v":"168 - 1"}]
[null,null,null,null,null,null,null,null,null,null,null,null,null,null,null,null,null,null,null,null,null,null,null,null,null,null,{"$f":"CONCATENATE(LEFT(AA217,3),\" - 2\")","v":"141 - 2"},{"$f":"CONCATENATE(LEFT(AB217,3)+1,\" - 1\")","v":"148 - 1"},{"$f":"CONCATENATE(LEFT(AC217,3),\" - 4\")","v":"154 - 4"},{"$f":"CONCATENATE(LEFT(AD217,3),\" - 3\")","v":"161 - 3"},{"$f":"CONCATENATE(LEFT(AE217,3),\" - 2\")","v":"168 - 2"}]
[null,null,null,null,null,null,null,null,null,null,null,null,null,null,null,null,null,null,null,null,null,null,null,null,null,null,{"$f":"CONCATENATE(LEFT(AA218,3),\" - 3\")","v":"141 - 3"},{"$f":"CONCATENATE(LEFT(AB218,3),\" - 2\")","v":"148 - 2"},{"$f":"CONCATENATE(LEFT(AC218,3)+1,\" - 1\")","v":"155 - 1"},{"$f":"CONCATENATE(LEFT(AD218,3),\" - 4\")","v":"161 - 4"},{"$f":"CONCATENATE(LEFT(AE218,3),\" - 3\")","v":"168 - 3"}]
[null,null,null,null,null,null,null,null,null,null,null,null,null,null,null,null,null,null,null,null,null,null,null,null,null,null,{"$f":"CONCATENATE(LEFT(AA219,3),\" - 4\")","v":"141 - 4"},{"$f":"CONCATENATE(LEFT(AB219,3),\" - 3\")","v":"148 - 3"},{"$f":"CONCATENATE(LEFT(AC219,3),\" - 2\")","v":"155 - 2"},{"$f":"CONCATENATE(LEFT(AD219,3)+1,\" - 1\")","v":"162 - 1"},{"$f":"CONCATENATE(LEFT(AE219,3),\" - 4\")","v":"168 - 4"}]
[null,null,null,null,null,null,null,null,null,null,null,null,null,null,null,null,null,null,null,null,null,null,null,null,null,null,{"$f":"CONCATENATE(LEFT(AA220,3)+1,\" - 1\")","v":"142 - 1"},{"$f":"CONCATENATE(LEFT(AB220,3),\" - 4\")","v":"148 - 4"},{"$f":"CONCATENATE(LEFT(AC220,3),\" - 3\")","v":"155 - 3"},{"$f":"CONCATENATE(LEFT(AD220,3),\" - 2\")","v":"162 - 2"},{"$f":"CONCATENATE(LEFT(AE220,3)+1,\" - 1\")","v":"169 - 1"}]
[null,null,null,null,null,null,null,null,null,null,null,null,null,null,null,null,null,null,null,null,null,null,null,null,null,null,{"$f":"CONCATENATE(LEFT(AA221,3),\" - 2\")","v":"142 - 2"},{"$f":"CONCATENATE(LEFT(AB221,3)+1,\" - 1\")","v":"149 - 1"},{"$f":"CONCATENATE(LEFT(AC221,3),\" - 4\")","v":"155 - 4"},{"$f":"CONCATENATE(LEFT(AD221,3),\" - 3\")","v":"162 - 3"},{"$f":"CONCATENATE(LEFT(AE221,3),\" - 2\")","v":"169 - 2"}]
[null,null,null,null,null,null,null,null,null,null,null,null,null,null,null,null,null,null,null,null,null,null,null,null,null,null,{"$f":"CONCATENATE(LEFT(AA222,3),\" - 3\")","v":"142 - 3"},{"$f":"CONCATENATE(LEFT(AB222,3),\" - 2\")","v":"149 - 2"},{"$f":"CONCATENATE(LEFT(AC222,3)+1,\" - 1\")","v":"156 - 1"},{"$f":"CONCATENATE(LEFT(AD222,3),\" - 4\")","v":"162 - 4"},{"$f":"CONCATENATE(LEFT(AE222,3),\" - 3\")","v":"169 - 3"}]
[]
[null,null,null,null,null,null,null,null,null,null,null,null,null,null,null,null,null,null,null,null,null,null,null,null,null,null,{"$f":"IF($K$48=\"E\",AE195+1000,AE195+900)","v":608400},{"$f":"IF($K$48=\"E\",AA251+1000,AA251+900)","v":632700},{"$f":"IF($K$48=\"E\",AB251+1000,AB251+900)","v":657000},{"$f":"IF($K$48=\"E\",AC251+1000,AC251+900)","v":681300},{"$f":"IF($K$48=\"E\",AD251+1000,AD251+900)","v":705600}]
[null,null,null,null,null,null,null,null,null,null,null,null,null,null,null,null,null,null,null,null,null,null,null,null,null,null,{"$f":"IF($K$48=\"E\",AA225+1000,AA225+900)","v":609300},{"$f":"IF($K$48=\"E\",AB225+1000,AB225+900)","v":633600},{"$f":"IF($K$48=\"E\",AC225+1000,AC225+900)","v":657900},{"$f":"IF($K$48=\"E\",AD225+1000,AD225+900)","v":682200},{"$f":"IF($K$48=\"E\",AE225+1000,AE225+900)","v":706500}]
[null,null,null,null,null,null,null,null,null,null,null,null,null,null,null,null,null,null,null,null,null,null,null,null,null,null,610200,634500,658800,683100,707400]
[null,null,null,null,null,null,null,null,null,null,null,null,null,null,null,null,null,null,null,null,null,null,null,null,null,null,611100,635400,659700,684000,708300]
[null,null,null,null,null,null,null,null,null,null,null,null,null,null,null,null,null,null,null,null,null,null,null,null,null,null,612000,636300,660600,684900,709200]
[null,null,null,null,null,null,null,null,null,null,null,null,null,null,null,null,null,null,null,null,null,null,null,null,null,null,612900,637200,661500,685800,710100]
[null,null,null,null,null,null,null,null,null,null,null,null,null,null,null,null,null,null,null,null,null,null,null,null,null,null,613800,638100,662400,686700,711000]
[null,null,null,null,null,null,null,null,null,null,null,null,null,null,null,null,null,null,null,null,null,null,null,null,null,null,614700,639000,663300,687600,711900]
[null,null,null,null,null,null,null,null,null,null,null,null,null,null,null,null,null,null,null,null,null,null,null,null,null,null,615600,639900,664200,688500,712800]
[null,null,null,null,null,null,null,null,null,null,null,null,null,null,null,null,null,null,null,null,null,null,null,null,null,null,616500,640800,665100,689400,713700]
[null,null,null,null,null,null,null,null,null,null,null,null,null,null,null,null,null,null,null,null,null,null,null,null,null,null,617400,641700,666000,690300,714600]
[null,null,null,null,null,null,null,null,null,null,null,null,null,null,null,null,null,null,null,null,null,null,null,null,null,null,618300,642600,666900,691200,715500]
[null,null,null,null,null,null,null,null,null,null,null,null,null,null,null,null,null,null,null,null,null,null,null,null,null,null,619200,643500,667800,692100,716400]
[null,null,null,null,null,null,null,null,null,null,null,null,null,null,null,null,null,null,null,null,null,null,null,null,null,null,620100,644400,668700,693000,717300]
[null,null,null,null,null,null,null,null,null,null,null,null,null,null,null,null,null,null,null,null,null,null,null,null,null,null,621000,645300,669600,693900,718200]
[null,null,null,null,null,null,null,null,null,null,null,null,null,null,null,null,null,null,null,null,null,null,null,null,null,null,621900,646200,670500,694800,719100]
[null,null,null,null,null,null,null,null,null,null,null,null,null,null,null,null,null,null,null,null,null,null,null,null,null,null,622800,647100,671400,695700,720000]
[null,null,null,null,null,null,null,null,null,null,null,null,null,null,null,null,null,null,null,null,null,null,null,null,null,null,623700,648000,672300,696600,720900]
[null,null,null,null,null,null,null,null,null,null,null,null,null,null,null,null,null,null,null,null,null,null,null,null,null,null,624600,648900,673200,697500,721800]
[null,null,null,null,null,null,null,null,null,null,null,null,null,null,null,null,null,null,null,null,null,null,null,null,null,null,625500,649800,674100,698400,722700]
[null,null,null,null,null,null,null,null,null,null,null,null,null,null,null,null,null,null,null,null,null,null,null,null,null,null,626400,650700,675000,699300,723600]
[null,null,null,null,null,null," ",null,null,null,null,null,null,null,null,null,null,null,null,null,null,null,null,null,null,null,627300,651600,675900,700200,724500]
[null,null,null,null,null,null,null,null,null,null,null,null,null,null,null,null,null,null,null,null,null,null,null,null,null,null,628200,652500,676800,701100,725400]
[null,null,null,null,null,null,null,null,null,null,null,null,null,null,null,null,null,null,null,null,null,null,null,null,null,null,629100,653400,677700,702000,726300]
[null,null,null,null,null,null,null,null,null,null,null,null,null,null,null,null,null,null,null,null,null,null,null,null,null,null,630000,654300,678600,702900,727200]
[null,null,null,null,null,null,null,null,null,null,null,null,null,null,null,null,null,null,null,null,null,null,null,null,null,null,630900,655200,679500,703800,728100]
[null,null,null,null,null,null,null,null,null,null,null,null,null,null,null,null,null,null,null,null,null,null,null,null,null,null,631800,656100,680400,704700,729000]
[]
[null,null,null,null,null,null,null,null,null,null,null,null,null,null,null,null,null,null,null,null,null,null,null,null,null,null,"169 - 4",{"$f":"CONCATENATE(LEFT(AA279,3),\" - 3\")","v":"176 - 3"},{"$f":"CONCATENATE(LEFT(AB279,3),\" - 2\")","v":"183 - 2"},{"$f":"CONCATENATE(LEFT(AC279,3)+1,\" - 1\")","v":"190 - 1"},{"$f":"CONCATENATE(LEFT(AD279,3),\" - 4\")","v":"196 - 4"}]
[null,null,null,null,null,null,null,null,null,null,null,null,null,null,null,null,null,null,null,null,null,null,null,null,null,null,{"$f":"CONCATENATE(LEFT(AA253,3)+1,\" - 1\")","v":"170 - 1"},{"$f":"CONCATENATE(LEFT(AB253,3),\" - 4\")","v":"176 - 4"},{"$f":"CONCATENATE(LEFT(AC253,3),\" - 3\")","v":"183 - 3"},{"$f":"CONCATENATE(LEFT(AD253,3),\" - 2\")","v":"190 - 2"},{"$f":"CONCATENATE(LEFT(AE253,3)+1,\" - 1\")","v":"197 - 1"}]
[null,null,null,null,null,null,null,null,null,null,null,null,null,null,null,null,null,null,null,null,null,null,null,null,null,null,{"$f":"CONCATENATE(LEFT(AA254,3),\" - 2\")","v":"170 - 2"},{"$f":"CONCATENATE(LEFT(AB254,3)+1,\" - 1\")","v":"177 - 1"},{"$f":"CONCATENATE(LEFT(AC254,3),\" - 4\")","v":"183 - 4"},{"$f":"CONCATENATE(LEFT(AD254,3),\" - 3\")","v":"190 - 3"},{"$f":"CONCATENATE(LEFT(AE254,3),\" - 2\")","v":"197 - 2"}]
[null,null,null,null,null,null,null,null,null,null,null,null,null,null,null,null,null,null,null,null,null,null,null,null,null,null,{"$f":"CONCATENATE(LEFT(AA255,3),\" - 3\")","v":"170 - 3"},{"$f":"CONCATENATE(LEFT(AB255,3),\" - 2\")","v":"177 - 2"},{"$f":"CONCATENATE(LEFT(AC255,3)+1,\" - 1\")","v":"184 - 1"},{"$f":"CONCATENATE(LEFT(AD255,3),\" - 4\")","v":"190 - 4"},{"$f":"CONCATENATE(LEFT(AE255,3),\" - 3\")","v":"197 - 3"}]
[null,null,null,null,null,null,null,null,null,null,null,null,null,null,null,null,null,null,null,null,null,null,null,null,null,null,{"$f":"CONCATENATE(LEFT(AA256,3),\" - 4\")","v":"170 - 4"},{"$f":"CONCATENATE(LEFT(AB256,3),\" - 3\")","v":"177 - 3"},{"$f":"CONCATENATE(LEFT(AC256,3),\" - 2\")","v":"184 - 2"},{"$f":"CONCATENATE(LEFT(AD256,3)+1,\" - 1\")","v":"191 - 1"},{"$f":"CONCATENATE(LEFT(AE256,3),\" - 4\")","v":"197 - 4"}]
[null,null,null,null,null,null,null,null,null,null,null,null,null,null,null,null,null,null,null,null,null,null,null,null,null,null,{"$f":"CONCATENATE(LEFT(AA257,3)+1,\" - 1\")","v":"171 - 1"},{"$f":"CONCATENATE(LEFT(AB257,3),\" - 4\")","v":"177 - 4"},{"$f":"CONCATENATE(LEFT(AC257,3),\" - 3\")","v":"184 - 3"},{"$f":"CONCATENATE(LEFT(AD257,3),\" - 2\")","v":"191 - 2"},{"$f":"CONCATENATE(LEFT(AE257,3)+1,\" - 1\")","v":"198 - 1"}]
[null,null,null,null,null,null,null,null,null,null,null,null,null,null,null,null,null,null,null,null,null,null,null,null,null,null,{"$f":"CONCATENATE(LEFT(AA258,3),\" - 2\")","v":"171 - 2"},{"$f":"CONCATENATE(LEFT(AB258,3)+1,\" - 1\")","v":"178 - 1"},{"$f":"CONCATENATE(LEFT(AC258,3),\" - 4\")","v":"184 - 4"},{"$f":"CONCATENATE(LEFT(AD258,3),\" - 3\")","v":"191 - 3"},{"$f":"CONCATENATE(LEFT(AE258,3),\" - 2\")","v":"198 - 2"}]
[null,null,null,null,null,null,null,null,null,null,null,null,null,null,null,null,null,null,null,null,null,null,null,null,null,null,{"$f":"CONCATENATE(LEFT(AA259,3),\" - 3\")","v":"171 - 3"},{"$f":"CONCATENATE(LEFT(AB259,3),\" - 2\")","v":"178 - 2"},{"$f":"CONCATENATE(LEFT(AC259,3)+1,\" - 1\")","v":"185 - 1"},{"$f":"CONCATENATE(LEFT(AD259,3),\" - 4\")","v":"191 - 4"},{"$f":"CONCATENATE(LEFT(AE259,3),\" - 3\")","v":"198 - 3"}]
[null,null,null,null,null,null,null,null,null,null,null,null,null,null,null,null,null,null,null,null,null,null,null,null,null,null,{"$f":"CONCATENATE(LEFT(AA260,3),\" - 4\")","v":"171 - 4"},{"$f":"CONCATENATE(LEFT(AB260,3),\" - 3\")","v":"178 - 3"},{"$f":"CONCATENATE(LEFT(AC260,3),\" - 2\")","v":"185 - 2"},{"$f":"CONCATENATE(LEFT(AD260,3)+1,\" - 1\")","v":"192 - 1"},{"$f":"CONCATENATE(LEFT(AE260,3),\" - 4\")","v":"198 - 4"}]
[null,null,null,null,null,null,null,null,null,null,null,null,null,null,null,null,null,null,null,null,null,null,null,null,null,null,{"$f":"CONCATENATE(LEFT(AA261,3)+1,\" - 1\")","v":"172 - 1"},{"$f":"CONCATENATE(LEFT(AB261,3),\" - 4\")","v":"178 - 4"},{"$f":"CONCATENATE(LEFT(AC261,3),\" - 3\")","v":"185 - 3"},{"$f":"CONCATENATE(LEFT(AD261,3),\" - 2\")","v":"192 - 2"},{"$f":"CONCATENATE(LEFT(AE261,3)+1,\" - 1\")","v":"199 - 1"}]
[null,null,null,null,null,null,null,null,null,null,null,null,null,null,null,null,null,null,null,null,null,null,null,null,null,null,{"$f":"CONCATENATE(LEFT(AA262,3),\" - 2\")","v":"172 - 2"},{"$f":"CONCATENATE(LEFT(AB262,3)+1,\" - 1\")","v":"179 - 1"},{"$f":"CONCATENATE(LEFT(AC262,3),\" - 4\")","v":"185 - 4"},{"$f":"CONCATENATE(LEFT(AD262,3),\" - 3\")","v":"192 - 3"},{"$f":"CONCATENATE(LEFT(AE262,3),\" - 2\")","v":"199 - 2"}]
[null,null,null,null,null,null,null,null,null,null,null,null,null,null,null,null,null,null,null,null,null,null,null,null,null,null,{"$f":"CONCATENATE(LEFT(AA263,3),\" - 3\")","v":"172 - 3"},{"$f":"CONCATENATE(LEFT(AB263,3),\" - 2\")","v":"179 - 2"},{"$f":"CONCATENATE(LEFT(AC263,3)+1,\" - 1\")","v":"186 - 1"},{"$f":"CONCATENATE(LEFT(AD263,3),\" - 4\")","v":"192 - 4"},{"$f":"CONCATENATE(LEFT(AE263,3),\" - 3\")","v":"199 - 3"}]
[null,null,null,null,null,null,null,null,null,null,null,null,null,null,null,null,null,null,null,null,null,null,null,null,null,null,{"$f":"CONCATENATE(LEFT(AA264,3),\" - 4\")","v":"172 - 4"},{"$f":"CONCATENATE(LEFT(AB264,3),\" - 3\")","v":"179 - 3"},{"$f":"CONCATENATE(LEFT(AC264,3),\" - 2\")","v":"186 - 2"},{"$f":"CONCATENATE(LEFT(AD264,3)+1,\" - 1\")","v":"193 - 1"},{"$f":"CONCATENATE(LEFT(AE264,3),\" - 4\")","v":"199 - 4"}]
[null,null,null,null,null,null,null,null,null,null,null,null,null,null,null,null,null,null,null,null,null,null,null,null,null,null,{"$f":"CONCATENATE(LEFT(AA265,3)+1,\" - 1\")","v":"173 - 1"},{"$f":"CONCATENATE(LEFT(AB265,3),\" - 4\")","v":"179 - 4"},{"$f":"CONCATENATE(LEFT(AC265,3),\" - 3\")","v":"186 - 3"},{"$f":"CONCATENATE(LEFT(AD265,3),\" - 2\")","v":"193 - 2"},{"$f":"CONCATENATE(LEFT(AE265,3)+1,\" - 1\")","v":"200 - 1"}]
[null,null,null,null,null,null,null,null,null,null,null,null,null,null,null,null,null,null,null,null,null,null,null,null,null,null,{"$f":"CONCATENATE(LEFT(AA266,3),\" - 2\")","v":"173 - 2"},{"$f":"CONCATENATE(LEFT(AB266,3)+1,\" - 1\")","v":"180 - 1"},{"$f":"CONCATENATE(LEFT(AC266,3),\" - 4\")","v":"186 - 4"},{"$f":"CONCATENATE(LEFT(AD266,3),\" - 3\")","v":"193 - 3"},{"$f":"CONCATENATE(LEFT(AE266,3),\" - 2\")","v":"200 - 2"}]
[null,null,null,null,null,null,null,null,null,null,null,null,null,null,null,null,null,null,null,null,null,null,null,null,null,null,{"$f":"CONCATENATE(LEFT(AA267,3),\" - 3\")","v":"173 - 3"},{"$f":"CONCATENATE(LEFT(AB267,3),\" - 2\")","v":"180 - 2"},{"$f":"CONCATENATE(LEFT(AC267,3)+1,\" - 1\")","v":"187 - 1"},{"$f":"CONCATENATE(LEFT(AD267,3),\" - 4\")","v":"193 - 4"},{"$f":"CONCATENATE(LEFT(AE267,3),\" - 3\")","v":"200 - 3"}]
[null,null,null,null,null,null,null,null,null,null,null,null,null,null,null,null,null,null,null,null,null,null,null,null,null,null,{"$f":"CONCATENATE(LEFT(AA268,3),\" - 4\")","v":"173 - 4"},{"$f":"CONCATENATE(LEFT(AB268,3),\" - 3\")","v":"180 - 3"},{"$f":"CONCATENATE(LEFT(AC268,3),\" - 2\")","v":"187 - 2"},{"$f":"CONCATENATE(LEFT(AD268,3)+1,\" - 1\")","v":"194 - 1"},{"$f":"CONCATENATE(LEFT(AE268,3),\" - 4\")","v":"200 - 4"}]
[null,null,null,null,null,null,null,null,null,null,null,null,null,null,null,null,null,null,null,null,null,null,null,null,null,null,{"$f":"CONCATENATE(LEFT(AA269,3)+1,\" - 1\")","v":"174 - 1"},{"$f":"CONCATENATE(LEFT(AB269,3),\" - 4\")","v":"180 - 4"},{"$f":"CONCATENATE(LEFT(AC269,3),\" - 3\")","v":"187 - 3"},{"$f":"CONCATENATE(LEFT(AD269,3),\" - 2\")","v":"194 - 2"},{"$f":"CONCATENATE(LEFT(AE269,3)+1,\" - 1\")","v":"201 - 1"}]
[null,null,null,null,null,null,null,null,null,null,null,null,null,null,null,null,null,null,null,null,null,null,null,null,null,null,{"$f":"CONCATENATE(LEFT(AA270,3),\" - 2\")","v":"174 - 2"},{"$f":"CONCATENATE(LEFT(AB270,3)+1,\" - 1\")","v":"181 - 1"},{"$f":"CONCATENATE(LEFT(AC270,3),\" - 4\")","v":"187 - 4"},{"$f":"CONCATENATE(LEFT(AD270,3),\" - 3\")","v":"194 - 3"},{"$f":"CONCATENATE(LEFT(AE270,3),\" - 2\")","v":"201 - 2"}]
[null,null,null,null,null,null,null,null,null,null,null,null,null,null,null,null,null,null,null,null,null,null,null,null,null,null,{"$f":"CONCATENATE(LEFT(AA271,3),\" - 3\")","v":"174 - 3"},{"$f":"CONCATENATE(LEFT(AB271,3),\" - 2\")","v":"181 - 2"},{"$f":"CONCATENATE(LEFT(AC271,3)+1,\" - 1\")","v":"188 - 1"},{"$f":"CONCATENATE(LEFT(AD271,3),\" - 4\")","v":"194 - 4"},{"$f":"CONCATENATE(LEFT(AE271,3),\" - 3\")","v":"201 - 3"}]
[null,null,null,null,null,null,null,null,null,null,null,null,null,null,null,null,null,null,null,null,null,null,null,null,null,null,{"$f":"CONCATENATE(LEFT(AA272,3),\" - 4\")","v":"174 - 4"},{"$f":"CONCATENATE(LEFT(AB272,3),\" - 3\")","v":"181 - 3"},{"$f":"CONCATENATE(LEFT(AC272,3),\" - 2\")","v":"188 - 2"},{"$f":"CONCATENATE(LEFT(AD272,3)+1,\" - 1\")","v":"195 - 1"},{"$f":"CONCATENATE(LEFT(AE272,3),\" - 4\")","v":"201 - 4"}]
[null,null,null,null,null,null,null,null,null,null,null,null,null,null,null,null,null,null,null,null,null,null,null,null,null,null,{"$f":"CONCATENATE(LEFT(AA273,3)+1,\" - 1\")","v":"175 - 1"},{"$f":"CONCATENATE(LEFT(AB273,3),\" - 4\")","v":"181 - 4"},{"$f":"CONCATENATE(LEFT(AC273,3),\" - 3\")","v":"188 - 3"},{"$f":"CONCATENATE(LEFT(AD273,3),\" - 2\")","v":"195 - 2"},{"$f":"CONCATENATE(LEFT(AE273,3)+1,\" - 1\")","v":"202 - 1"}]
[null,null,null,null,null,null,null,null,null,null,null,null,null,null,null,null,null,null,null,null,null,null,null,null,null,null,{"$f":"CONCATENATE(LEFT(AA274,3),\" - 2\")","v":"175 - 2"},{"$f":"CONCATENATE(LEFT(AB274,3)+1,\" - 1\")","v":"182 - 1"},{"$f":"CONCATENATE(LEFT(AC274,3),\" - 4\")","v":"188 - 4"},{"$f":"CONCATENATE(LEFT(AD274,3),\" - 3\")","v":"195 - 3"},{"$f":"CONCATENATE(LEFT(AE274,3),\" - 2\")","v":"202 - 2"}]
[null,null,null,null,null,null,null,null,null,null,null,null,null,null,null,null,null,null,null,null,null,null,null,null,null,null,{"$f":"CONCATENATE(LEFT(AA275,3),\" - 3\")","v":"175 - 3"},{"$f":"CONCATENATE(LEFT(AB275,3),\" - 2\")","v":"182 - 2"},{"$f":"CONCATENATE(LEFT(AC275,3)+1,\" - 1\")","v":"189 - 1"},{"$f":"CONCATENATE(LEFT(AD275,3),\" - 4\")","v":"195 - 4"},{"$f":"CONCATENATE(LEFT(AE275,3),\" - 3\")","v":"202 - 3"}]
[null,null,null,null,null,null,null,null,null,null,null,null,null,null,null,null,null,null,null,null,null,null,null,null,null,null,{"$f":"CONCATENATE(LEFT(AA276,3),\" - 4\")","v":"175 - 4"},{"$f":"CONCATENATE(LEFT(AB276,3),\" - 3\")","v":"182 - 3"},{"$f":"CONCATENATE(LEFT(AC276,3),\" - 2\")","v":"189 - 2"},{"$f":"CONCATENATE(LEFT(AD276,3)+1,\" - 1\")","v":"196 - 1"},{"$f":"CONCATENATE(LEFT(AE276,3),\" - 4\")","v":"202 - 4"}]
[null,null,null,null,null,null,null,null,null,null,null,null,null,null,null,null,null,null,null,null,null,null,null,null,null,null,{"$f":"CONCATENATE(LEFT(AA277,3)+1,\" - 1\")","v":"176 - 1"},{"$f":"CONCATENATE(LEFT(AB277,3),\" - 4\")","v":"182 - 4"},{"$f":"CONCATENATE(LEFT(AC277,3),\" - 3\")","v":"189 - 3"},{"$f":"CONCATENATE(LEFT(AD277,3),\" - 2\")","v":"196 - 2"},{"$f":"CONCATENATE(LEFT(AE277,3)+1,\" - 1\")","v":"203 - 1"}]
[null,null,null,null,null,null,null,null,null,null,null,null,null,null,null,null,null,null,null,null,null,null,null,null,null,null,{"$f":"CONCATENATE(LEFT(AA278,3),\" - 2\")","v":"176 - 2"},{"$f":"CONCATENATE(LEFT(AB278,3)+1,\" - 1\")","v":"183 - 1"},{"$f":"CONCATENATE(LEFT(AC278,3),\" - 4\")","v":"189 - 4"},{"$f":"CONCATENATE(LEFT(AD278,3),\" - 3\")","v":"196 - 3"},{"$f":"CONCATENATE(LEFT(AE278,3),\" - 2\")","v":"203 - 2"}]

{"sheet":"Workbook Edits","index":15,"n_rows":24,"n_cols":3,"rows_kept":24,"cut":false,"hidden":true,"merged":[]}
["Tracks Pre-Production Workbook Changes"]
["Date","Initials","Description"]
["2006-08-17","BGP","Mapping completed.  Needs to be populated for testing."]
["2006-08-30","BGP","Added District to disicline tab."]
["2006-09-28","BGP","Revised the following edits as discussed with Troy on 8/30/06:\n- \"Sampler\", \"Tester\", \"Authorizer\" edits to be more complete;\n- t_smpl_tst.tst_meth to check t_tst_fee_sched\n- Add district to discipline tab\n- Re-validate authorizer (& witnessed by)  [NOTE: no changes in any discipline]\n- Add code table check for t_smpl.unt_t where missing\n- Redo format of DATE conversion on AMMIXPACK Test Template\n- Replace t_superpave key edit with t_cont_streq_matl table (rather than t_cont_itm)\n- Comment out std_rmrks_ind on t_smpl tab to be consistent with CONCMIX\n- Review Repr_Qty on all spreadsheet   [NOTE: no changes in any discipline]\nRevised the following due to Committee decisions:\n- Revise Test Start, Est. Compl., and Actual Compl. Dates (as specified in updated procedures)"]
["2006-10-12","BGP","Added \"Tab\" Hide/Unhide macros and removed green highlights for \"FINAL\" version."]
["2006-11-07","BGP","Corrected \"Date\" field on AMMIXPACK Test (t_tst_rslt_dtl) so that \"N/A\" will not be accidentally passed to Applet; Corrected Mix ID Num on Design Data tab so that leading zeros would be stored in SiteManager; Corrected \"Binder Grade\" table in Chart Data so that the correct code table value (rather than the description) is passed to SiteManager on the t_superpave record; Made sure \"N/A\" was not mistakenly passed for Sample ID on the t_bit_conc_mixblnd record;  Added edits in t_superpave and t_bit_conc_mixblnd for appropriate sample date used in edits (\"since only 1 sample\")."]
["2006-11-22","MB & MH","Adjustments to data to correspond to SM database (and thereby avoid edit errors)."]
["2006-11-22","BGP","Fixed edit on t_smpl.smpl_mix_id (SUPERPAVE not blank - which Troy was actually defaulting to the original PCC test done with the other concrete-based spreadsheets)."]
["2006-12-08","MDH","Replaced Lab, Sampler, and Tester data with valid KQTL data."]
["2006-12-11","BGP","Performance tuning (started using ScreenUpdating Property in background macros to help speed up processing); Added \"Filename\" (SampleIDRoot) to the discipline tab."]
["2006-12-13","TDS","Attached new map which includes the root sample id (filename).  The new map also ensures all dates from excel are in the same formate (serial date).  Conversion to normal date and format is handled in the applet.  All dates are tested for validity and that they don't exceed the current system date."]
["2006-12-20","MDH","Made changes to code to allow Non-Superpave mixtures to save correctly."]
["2007-01-03","MDH","Prefixed Lab ID with 'C' or 'T' to designate Contractor or KYTC lab."]
["2007-01-03","BGP","Re-enable t_bit_conc_mixblnd tab (and adjust Material Codes properly on Design Data tab so that no duplicates are found)."]
["2007-01-04","BGP","Fixed \"Hide\" & \"UnHide Macros; Fixed District assignement on discipline tab."]
["2007-01-10","BGP","Fixed the Authorized By edit on the t_superpave tab."]
["2007-01-18","BGP","Removed the edit on t_smpl.smpl_mix_id as this cannot be performed in the same file where the mix is being created; Also fixed TYPE OF ADDITIVE mapping on t_tst_rslt_dtl where tst_fld_sn = 159 (data was being pulled from incorrect cell)."]
["2007-02-07","BGP","Assigned new \"Template Status\" code table value in t_tst_rslt_dtl.F2 based on the value in t_smpl.smpl_stat (Global Template Change)."]
["2007-02-19","MDH&MTB","Added drop-downs to Liquid and Contractor P/S."]
["1958-03-01","MTB","Corrected error on 'Chart Data' chell Q14"]
["2007-04-04","MDH","Corrected 'Save As' errors on 'Design Data' tab;Corrected protection/locked cell issues"]
["2007-04-10","MDH","Blanked sheet for final version."]
["2007-07-31","MDH/MTB","Deployed new version 5.02/Discipline v2.0."]

{"sheet":"discipline","index":16,"n_rows":2,"n_cols":5,"rows_kept":2,"cut":false,"hidden":true,"merged":[]}
["discipline_id","discipline_version","replace_allowed_indicator","district","Filename"]
["AMMIXPACK","v3.0","Y",{"$f":"LEFT('Design Data'!C10,2)","v":""},{"$f":"'Design Data'!C10","v":0}]

{"sheet":"AMMIXPACK","index":17,"n_rows":248,"n_cols":26,"rows_kept":248,"cut":false,"hidden":true,"merged":[[9,12,9,14],[8,12,8,14],[7,12,7,14],[6,16,6,17],[5,16,5,17],[2,16,2,17],[26,12,26,14],[25,12,25,14],[24,12,24,14],[23,12,23,14],[22,12,22,14],[21,12,21,14],[20,12,20,14],[19,12,19,14],[18,12,18,14],[17,12,17,14],[16,12,16,14],[15,12,15,14],[14,12,14,14],[13,12,13,14],[6,12,6,14],[5,12,5,14],[4,12,4,14],[3,12,3,14],[12,12,12,14],[11,12,11,14],[10,12,10,14],[15,16,15,17],[14,16,14,17],[13,16,13,17],[12,16,12,17],[11,16,11,17],[10,16,10,17],[9,16,9,17],[8,16,8,17],[7,16,7,17],[24,16,24,17],[23,16,23,17],[22,16,22,17],[21,16,21,17],[20,16,20,17],[19,16,19,17],[18,16,18,17],[17,16,17,17],[16,16,16,17],[40,15,40,17],[41,15,41,17],[42,15,42,17],[43,15,43,17],[45,10,45,11],[40,10,40,11],[41,10,41,11],[51,6,51,7],[52,11,52,13],[47,11,47,17],[48,11,48,13],[48,15,48,17],[52,15,52,17],[47,1,47,8],[48,1,48,2],[49,1,49,2],[50,1,50,2],[51,1,51,2],[48,6,48,7],[49,6,49,7],[50,6,50,7],[49,11,49,13],[40,1,40,2],[41,1,41,2],[54,15,54,17],[44,15,44,17],[45,15,45,17],[49,15,49,17],[50,15,50,17],[51,15,51,17],[53,15,53,17],[53,11,53,13],[50,11,50,13],[51,11,51,13],[54,11,54,13],[33,1,33,2],[43,1,43,2],[40,8,40,9],[41,8,41,9],[43,3,43,7],[39,8,39,9],[39,1,39,2],[40,3,40,7],[41,3,41,7],[42,3,42,7],[34,1,34,2],[34,5,34,6],[45,8,45,9],[43,10,43,11],[42,8,42,9],[43,8,43,9],[44,8,44,9],[44,10,44,11],[42,10,42,11],[45,1,45,2],[44,3,44,7],[45,3,45,7],[44,1,44,2],[42,1,42,2],[39,15,39,17],[27,13,28,17],[25,5,25,9],[36,5,36,6],[35,8,35,9],[29,6,29,7],[30,6,30,7],[31,5,31,6],[29,8,29,10],[30,8,30,10],[31,8,31,9],[32,8,32,9],[39,10,39,11],[28,5,28,10],[32,5,32,6],[33,8,33,9],[39,3,39,7],[33,5,33,6],[30,12,30,14],[25,16,25,17],[35,5,35,6],[31,12,31,14],[34,8,34,9],[1,12,1,17],[1,7,1,10],[2,7,2,10],[38,1,38,17],[23,2,23,3],[31,1,31,2],[32,1,32,2],[28,1,28,3],[1,1,1,5],[5,3,5,5],[27,1,27,2],[4,7,4,9],[22,5,22,6],[23,5,23,6],[25,1,25,2],[22,8,22,9],[23,8,23,9],[4,3,4,5],[6,3,6,5],[9,1,9,5],[26,1,26,2],[36,8,36,9],[3,16,3,17],[4,16,4,17],[21,5,21,10],[2,3,2,5],[24,2,24,3],[7,1,7,5],[21,1,21,3],[24,5,24,6],[3,3,3,5],[22,2,22,3],[24,8,24,9]]}
[null,null,null,null,null,null,null,null,null,null,null,null,null,null,null,null,null,null,null,"SM Field","Cell","Type","Label","Length","English unit","Notes:"]
[null,"PROJECT INFORMATION",null,null,null,null,null,"Template Name:  AMMIXPACK",null,null,null,null,"MIXTURE DESIGN APPROVAL INFORMATION",null,null,null,null,null,null,"F8","B2","Label","PROJECT INFORMATION","N/A","N/A","OVERALL: Please follow fill coloration and bolding as pictured at left"]
[null,"SUBMITTAL TYPE:",null,"D3",null,null,null,"Descrip.:  MIX DESIGN SPREADSHEET",null,null,null,null,"Design Property",null,null,"Design Value","Criteria",null,null,"F9","B8","Alphanumeric","RAP Note",50,"N/A"]
[null,"COUNTY:",null,"D4",null,null,null,null,null,null,null,null,"Coarse Aggregate Angularity (%)",null,null,"P4","Q4",null,null,"F10","D3","Alphanumeric","SUBMITTAL TYPE:",40,"N/A"]
[null,"TOTAL TONS:",null,"D5",null,null,null,"GRADATION INFORMATION",null,null,null,null,"Fine Aggregate Angularity (%)",null,null,"P5","Q5",null,null,"F11","D4","Alphanumeric","COUNTY:",50,"N/A"]
[null,"DEPTH (mm):",null,"D6",null,null,null,"Sieve","JMF","\"WeighUp\"",null,null,"Flat & Elongated Particles (%)",null,null,"P6","Q6",null,null,"F12","D5","Numeric","TOTAL TONS:","6.0","Tons"]
[null,"BINDER GRADE:",null,"D7",null,null,null,"2 \"","I7","J7",null,null,"Clay Content (SE) (%)",null,null,"P7","Q7",null,null,"F13","D6","Numeric","DEPTH (mm):","3.0","mm"]
[null,"B8",null,null,null,null,null,"1 1/2 \"","I8","J8",null,null,"% VFA",null,null,"P8","Q8",null,null,"F14","D7","Alphanumeric","BINDER GRADE",10,"N/A"]
[null,null,null,null,null,null,null,"1 \"","I9","J9",null,null,"% VMA",null,null,"P9","Q9",null,null,"F15","B10","Label","4-PT. GYRATORY MIX DESIGN INFORMATION","N/A","N/A"]
[null,"4-PT. GYRATORY MIX DESIGN INFORMATION",null,null,null,null,null,"3/4 \"","I10","J10",null,null,"D/A Ratio",null,null,"P10","Q10",null,null,"F16","C11","Numeric","AC           ",1.1000000000000001,"%"]
[null,"AC","C11","D11","E11","F11",null,"1/2 \"","I11","J11",null,null,"% Gmm @ Ninitial",null,null,"P11","Q11",null,null,"F17","C12","Numeric","Gmmini  ",2.1,"%"]
[null,"Gmmini","C12","D12","E12","F12",null,"3/8 \"","I12","J12",null,null,"% Gmm @ Nmax",null,null,"P12","Q12",null,null,"F18","C13","Numeric","AV            ",2.1,"%"]
[null,"AV","C13","D13","E13","F13",null,"1/4 \"","I13","J13",null,null,"% Air Voids",null,null,"P13","Q13",null,null,"F19","C14","Numeric","VMA       ",2.1,"%"]
[null,"VMA","C14","D14","E14","F14",null,"#4","I14","J14",null,null,"Unit Weight (lb/ft3)",null,null,"P14",null,null,null,"F20","C15","Numeric","VFA         ",2.1,"%"]
[null,"VFA","C15","D15","E15","F15",null,"#8","I15","J15",null,null,"% AC",null,null,"P15","Q15",null,null,"F21","C16","Numeric","UW           ",3.1,"lbs/ft3"]
[null,"UW","C16","D16","E16","F16",null,"#16","I16","J16",null,null,"% Effective AC",null,null,"P16",null,null,null,"F22","C17","Numeric","MSG       ",1.3,"(no units)"]
[null,"MSG","C17","D17","E17","F17",null,"#30","I17","J17",null,null,"Maximum Specific Gravity",null,null,"P17",null,null,null,"F23","C18","Numeric","Eff. AC   ",1.1000000000000001,"%"]
[null,"Eff. AC","C18","D18","E18","F18",null,"#50","I18","J18",null,null,"% Absorbed AC (Mix)",null,null,"P18",null,null,null,"F24","C19","Numeric","Film Th  ",2.1,"(µm)"]
[null,"Film Th","C19","D19","E19","F19",null,"#100","I19","J19",null,null,"Gsb",null,null,"P19",null,null,null,"F25","C20","Numeric","D/A         ",1.1000000000000001,"(no units)"]
[null,"D/A","C20","D20","E20","F20",null,"#200","I20","J20",null,null,"Gse",null,null,"P20",null,null,null,"F26","D11","Numeric","Point 2 - AC           ",1.1000000000000001,"%"]
[null,null,null,null,null,null,null,null,null,null,null,null,"Film Thickness (µm)",null,null,"P21",null,null,null,"F27","D12","Numeric","Point 2 - Gmmini  ",2.1,"%"]
[null,"Reference Information",null,null,null,"APPROVAL INFORMATION",null,null,null,null,null,null,"Specimen Weight (g)",null,null,"P22",null,null,null,"F28","D13","Numeric","Point 2 - AV            ",2.1,"%"]
[null,"County:","C23",null,null,{"$f":"IF(OR(H7=1,H7=2),\"\",\"Complete SGC Des.\")","v":"Complete SGC Des."},null,"H23",{"$f":"IF(OR(H7=1,H7=2),\"\",\"1-Pt. SGC Des.\")","v":"1-Pt. SGC Des."},null,"K23",null,"TSR Weight (g)",null,null,"P23",null,null,null,"F29","D14","Numeric","Point 2 - VMA       ",2.1,"%"]
[null,"ID #:","C24",null,null,"App.-New Design",null,"H24","App.-Ref. Mix",null,"K24",null,"% TSR without additive",null,null,"P24","Q24",null,null,"F30","D15","Numeric","Point 2 - VFA         ",2.1,"%"]
[null,"Binder:","C25",null,null,"MCL Design",null,"H25","Contr. Design",null,"K25",null,"% TSR with additive",null,null,"P25","Q25",null,null,"F31","D16","Numeric","Point 2 - UW           ",3.1,"lbs/ft3"]
[null,"Date Released:",null,"D26",null,"Revised Asphalt Content (+ or - 0.3 %):",null,null,null,null,"K26",null,"% Additive",null,null,"P26",null,null,null,"F32","D17","Numeric","Point 2 - MSG       ",1.3,"(no units)"]
[null,"Design AC %:",null,"D27",null,null,null,null,null,null,null,null,"Type of Additive",null,null,"P27",null,null,null,"F33","D18","Numeric","Point 2 - Eff. AC   ",1.1000000000000001,"%"]
[null,"Job Complete?",null,"D28",null,null,null,null,null,null,null,null,"NOTES:","N28",null,null,null,null,null,"F34","D19","Numeric","Point 2 - Film Th  ",2.1,"(µm)"]
[null,"B29",null,null,null,"TSR INFORMATION",null,null,null,null,null,null,null,null,null,null,null,null,null,"F35","D20","Numeric","Point 2 - D/A         ",1.1000000000000001,"(no units)"]
[null,null,null,null,null,"% AC:","% ADDITIVE:",null,"TYPE OF ADDITIVE:",null,null,null,null,null,null,null,null,null,null,"F36","E11","Numeric","Point 3 - AC           ",1.1000000000000001,"%"]
[null,"RAP Information",null,null,null,"F31","G31",null,"I31",null,null,null,"TOTAL UNIT TEST COST",null,null,null,null,null,null,"F37","E12","Numeric","Point 3 - Gmmini  ",2.1,"%"]
[null,"% AC in RAP:",null,"D32",null,"% Air Voids w/o add.",null,"H32","% Air Voids with add.",null,"K32",null,"M32",null,null,null,null,null,null,"F38","E13","Numeric","Point 3 - AV            ",2.1,"%"]
[null,"% Virgin AC in mix:",null,"D33",null,"% Initial Saturation w/o Add.",null,"H33","% Initial Saturation with Add.",null,"K33",null,null,null,null,null,null,null,null,"F39","E14","Numeric","Point 3 - VMA       ",2.1,"%"]
[null,"% RAP AC in mix:",null,"D34",null,"% Final Saturation w/o Add.",null,"H34","% Final Saturation with Add.",null,"K34",null,null,null,null,null,null,null,null,"F40","E15","Numeric","Point 3 - VFA         ",2.1,"%"]
[null,"Total % AC in mix:",null,"D35",null,"Wet Strength w/o add. (psi)",null,"H35","Wet Strength with add. (psi)",null,"K35",null,null,null,null,null,null,null,null,"F41","E16","Numeric","Point 3 - UW           ",3.1,"lbs/ft3"]
[null,"RAP MSG's","C36","D36",null,"Dry Strength w/o add. (psi)",null,"H36","Dry Strength with add. (psi)",null,"K36",null,null,null,null,null,null,null,null,"F42","E17","Numeric","Point 3 - MSG       ",1.3,"(no units)"]
[null,null,"C37","D37",null,"% TSR w/o Add. = ",null,"H37","% TSR with Add. = ",null,"K37",null,null,null,null,null,null,null,null,"F43","E18","Numeric","Point 3 - Eff. AC   ",1.1000000000000001,"%"]
[null,null,null,null,null,null,null,null,null,null,null,null,null,null,null,null,null,null,null,"F44","E19","Numeric","Point 3 - Film Th  ",2.1,"(µm)"]
[null,"MIX DESIGN AGGREGATE INFORMATION",null,null,null,null,null,null,null,null,null,null,null,null,null,null,null,null,null,"F45","E20","Numeric","Point 3 - D/A         ",1.1000000000000001,"(no units)"]
[null,"AGG. PROD. NO.",null,"PRODUCER NAME",null,null,null,null,"MAT. CODE ",null,"AGG. TYPE",null,"Gsb","%","S/C","SiteManager Agg. Sample ID #",null,null,null,"F46","F11","Numeric","Point 4 - AC           ",1.1000000000000001,"%"]
[null,"B41",null,"D41",null,null,null,null,"I41",null,"K41",null,"M41","N41","O41","P41",null,null,null,"F47","F12","Numeric","Point 4 - Gmmini  ",2.1,"%"]
[null,"B42",null,"D42",null,null,null,null,"I42",null,"K42",null,"M42","N42","O42","P42",null,null,null,"F48","F13","Numeric","Point 4 - AV            ",2.1,"%"]
[null,"B43",null,"D43",null,null,null,null,"I43",null,"K43",null,"M43","N43","O43","P43",null,null,null,"F49","F14","Numeric","Point 4 - VMA       ",2.1,"%"]
[null,"B44",null,"D44",null,null,null,null,"I44",null,"K44",null,"M44","N44","O44","P44",null,null,null,"F50","F15","Numeric","Point 4 - VFA         ",2.1,"%"]
[null,"B45",null,"D45",null,null,null,null,"I45",null,"K45",null,"M45","N45","O45","P45",null,null,null,"F51","F16","Numeric","Point 4 - UW           ",3.1,"lbs/ft3"]
[null,"B46",null,"D46",null,null,null,null,"I46",null,"K46",null,"M46","N46","O46","P46",null,null,null,"F52","F17","Numeric","Point 4 - MSG       ",1.3,"(no units)"]
[null,null,null,null,null,null,null,null,null,null,null,null,null,null,null,null,null,null,null,"F53","F18","Numeric","Point 4 - Eff. AC   ",1.1000000000000001,"%"]
[null,"1-PT. CHECK PROPERTIES",null,null,null,null,null,null,null,null,null,"MCL CONSENSUS (& ADDITIONAL) VERIFICATION INFORMATION",null,null,null,null,null,null,null,"F54","F19","Numeric","Point 4 - Film Th  ",2.1,"(µm)"]
[null,"Unit Wt. (lb/ft3) =",null,"D49","D/A Ratio =","F49","AC (%) =",null,"I49",null,null,"TEST TYPE",null,null,"S/C","SiteManager Sample ID #",null,null,null,"F55","F20","Numeric","Point 4 - D/A         ",1.1000000000000001,"(no units)"]
[null,"% Air Voids =",null,"D50","Gmm =","F50","% VMA =",null,"I50",null,null,"L50",null,null,"O50","P50",null,null,null,"F56","H2","Label","Template Name:  AMMIXPACK","N/A","N/A"]
[null,"% VFA =",null,"D51","% Eff. AC =","F51","% Abs. AC (Mix) =",null,"I51",null,null,"L51",null,null,"O51","P51",null,null,null,"F57","H3","Label","Descrip.:  MIX DESIGN SPREADSHEET","N/A","N/A"]
[null,"Gsb =",null,"D52","Gse =","F52","ESAL Class",null,"I52",null,null,"L52",null,null,"O52","P52",null,null,null,"F58","H5","Label","GRADATION INFORMATION","N/A","N/A"]
[null,null,null,null,null,null,null,null,null,null,null,"L53",null,null,"O53","P53",null,null,null,"F59","H6","Label","Sieve","N/A","N/A"]
[null,null,null,null,null,null,null,null,null,null,null,"L54",null,null,"O54","P54",null,null,null,"F60","I6","Label","JMF","N/A","N/A"]
[null,null,null,null,null,null,null,null,null,null,null,"L55",null,null,"O55","P55",null,null,null,"F61","I7","Numeric","2 \"         ","3.0","%"]
[null,null,null,null,null,null,null,null,null,null,null,null,null,null,null,null,null,null,null,"F62","I8","Numeric","1 1/2 \"   ","3.0","%"]
[null,null,null,null,null,null,null,null,null,null,null,null,null,null,null,null,null,null,null,"F63","I9","Numeric","1 \"          ","3.0","%"]
[null,null,null,null,null,null,null,null,null,null,null,null,null,null,null,null,null,null,null,"F64","I10","Numeric","3/4 \"     ","3.0","%"]
[null,null,null,null,null,null,null,null,null,null,null,null,null,null,null,null,null,null,null,"F65","I11","Numeric","1/2 \"      ","3.0","%"]
[null,null,null,null,null,null,null,null,null,null,null,null,null,null,null,null,null,null,null,"F66","I12","Numeric","3/8 \"     ","3.0","%"]
[null,null,null,null,null,null,null,null,null,null,null,null,null,null,null,null,null,null,null,"F67","I13","Numeric","1/4 \"      ","3.0","%"]
[null,null,null,null,null,null,null,null,null,null,null,null,null,null,null,null,null,null,null,"F68","I14","Numeric","#4         ","3.0","%"]
[null,null,null,null,null,null,null,null,null,null,null,null,null,null,null,null,null,null,null,"F69","I15","Numeric","#8         ","3.0","%"]
[null,null,null,null,null,null,null,null,null,null,null,null,null,null,null,null,null,null,null,"F70","I16","Numeric","#16        ","3.0","%"]
[null,null,null,null,null,null,null,null,null,null,null,null,null,null,null,null,null,null,null,"F71","I17","Numeric","#30       ","3.0","%"]
[null,null,null,null,null,null,null,null,null,null,null,null,null,null,null,null,null,null,null,"F72","I18","Numeric","#50       ","3.0","%"]
[null,null,null,null,null,null,null,null,null,null,null,null,null,null,null,null,null,null,null,"F73","I19","Numeric","#100      ","3.0","%"]
[null,null,null,null,null,null,null,null,null,null,null,null,null,null,null,null,null,null,null,"F74","I20","Numeric","#200     ",2.1,"%"]
[null,null,null,null,null,null,null,null,null,null,null,null,null,null,null,null,null,null,null,"F75","J6","Label","\"WeighUp\"","N/A","N/A"]
[null,null,null,null,null,null,null,null,null,null,null,null,null,null,null,null,null,null,null,"F76","J7","Numeric","WeighUp - 2 \"         ","3.0","%"]
[null,null,null,null,null,null,null,null,null,null,null,null,null,null,null,null,null,null,null,"F77","J8","Numeric","WeighUp - 1 1/2 \"   ","3.0","%"]
[null,null,null,null,null,null,null,null,null,null,null,null,null,null,null,null,null,null,null,"F78","J9","Numeric","WeighUp - 1 \"          ","3.0","%"]
[null,null,null,null,null,null,null,null,null,null,null,null,null,null,null,null,null,null,null,"F79","J10","Numeric","WeighUp - 3/4 \"     ","3.0","%"]
[null,null,null,null,null,null,null,null,null,null,null,null,null,null,null,null,null,null,null,"F80","J11","Numeric","WeighUp - 1/2 \"      ","3.0","%"]
[null,null,null,null,null,null,null,null,null,null,null,null,null,null,null,null,null,null,null,"F81","J12","Numeric","WeighUp - 3/8 \"     ","3.0","%"]
[null,null,null,null,null,null,null,null,null,null,null,null,null,null,null,null,null,null,null,"F82","J13","Numeric","WeighUp - 1/4 \"      ","3.0","%"]
[null,null,null,null,null,null,null,null,null,null,null,null,null,null,null,null,null,null,null,"F83","J14","Numeric","WeighUp - #4         ","3.0","%"]
[null,null,null,null,null,null,null,null,null,null,null,null,null,null,null,null,null,null,null,"F84","J15","Numeric","WeighUp - #8         ","3.0","%"]
[null,null,null,null,null,null,null,null,null,null,null,null,null,null,null,null,null,null,null,"F85","J16","Numeric","WeighUp - #16        ","3.0","%"]
[null,null,null,null,null,null,null,null,null,null,null,null,null,null,null,null,null,null,null,"F86","J17","Numeric","WeighUp - #30       ","3.0","%"]
[null,null,null,null,null,null,null,null,null,null,null,null,null,null,null,null,null,null,null,"F87","J18","Numeric","WeighUp - #50       ","3.0","%"]
[null,null,null,null,null,null,null,null,null,null,null,null,null,null,null,null,null,null,null,"F88","J19","Numeric","WeighUp - #100      ","3.0","%"]
[null,null,null,null,null,null,null,null,null,null,null,null,null,null,null,null,null,null,null,"F89","J20","Numeric","WeighUp - #200     ",2.1,"%"]
[null,null,null,null,null,null,null,null,null,null,null,null,null,null,null,null,null,null,null,"F90","M2","Label","MIXTURE DESIGN APPROVAL INFORMATION","N/A","N/A"]
[null,null,null,null,null,null,null,null,null,null,null,null,null,null,null,null,null,null,null,"F91","M3","Label","Design Property","N/A","N/A"]
[null,null,null,null,null,null,null,null,null,null,null,null,null,null,null,null,null,null,null,"F92","N28","Alphanumeric","Notes",256,"N/A"]
[null,null,null,null,null,null,null,null,null,null,null,null,null,null,null,null,null,null,null,"F93","P3","Label","Design Value","N/A","N/A"]
[null,null,null,null,null,null,null,null,null,null,null,null,null,null,null,null,null,null,null,"F94","P4","Alphanumeric","Coarse Aggregate Angularity (%)",10,"% / %"]
[null,null,null,null,null,null,null,null,null,null,null,null,null,null,null,null,null,null,null,"F95","P5","Numeric","Fine Aggregate Angularity (%)","2.0","%"]
[null,null,null,null,null,null,null,null,null,null,null,null,null,null,null,null,null,null,null,"F96","P6","Numeric","Flat & Elongated Particles (%)","2.0","%"]
[null,null,null,null,null,null,null,null,null,null,null,null,null,null,null,null,null,null,null,"F97","P7","Numeric","Clay Content (SE) (%)","2.0","%"]
[null,null,null,null,null,null,null,null,null,null,null,null,null,null,null,null,null,null,null,"F98","P8","Numeric","% VFA","2.1","%"]
[null,null,null,null,null,null,null,null,null,null,null,null,null,null,null,null,null,null,null,"F99","P9","Numeric","% VMA","2.1","%"]
[null,null,null,null,null,null,null,null,null,null,null,null,null,null,null,null,null,null,null,"F100","P10","Numeric","D/A Ratio","1.1","(no units)"]
[null,null,null,null,null,null,null,null,null,null,null,null,null,null,null,null,null,null,null,"F101","P11","Numeric","% Gmm @ Ninitial","2.1","%"]
[null,null,null,null,null,null,null,null,null,null,null,null,null,null,null,null,null,null,null,"F102","P12","Numeric","% Gmm @ Nmax","2.1","%"]
[null,null,null,null,null,null,null,null,null,null,null,null,null,null,null,null,null,null,null,"F103","P13","Numeric","% Air Voids","2.1","%"]
[null,null,null,null,null,null,null,null,null,null,null,null,null,null,null,null,null,null,null,"F104","P14","Numeric","Unit Weight (lb/ft3)","3.1","lbs/ft3"]
[null,null,null,null,null,null,null,null,null,null,null,null,null,null,null,null,null,null,null,"F105","P15","Numeric","% AC","2.1","%"]
[null,null,null,null,null,null,null,null,null,null,null,null,null,null,null,null,null,null,null,"F106","P16","Numeric","% Effective AC","2.1","%"]
[null,null,null,null,null,null,null,null,null,null,null,null,null,null,null,null,null,null,null,"F107","P17","Numeric","Maximum Specific Gravity","1.3","(no units)"]
[null,null,null,null,null,null,null,null,null,null,null,null,null,null,null,null,null,null,null,"F108","P18","Numeric","% Absorbed AC (Mix)","1.2","%"]
[null,null,null,null,null,null,null,null,null,null,null,null,null,null,null,null,null,null,null,"F109","P19","Numeric","Gsb","1.2","(no units)"]
[null,null,null,null,null,null,null,null,null,null,null,null,null,null,null,null,null,null,null,"F110","P20","Numeric","Gse","1.3","(no units)"]
[null,null,null,null,null,null,null,null,null,null,null,null,null,null,null,null,null,null,null,"F111","P21","Numeric","Film Thickness (µm)","2.1","(µm)"]
[null,null,null,null,null,null,null,null,null,null,null,null,null,null,null,null,null,null,null,"F112","P22","Numeric","Specimen Weight (g)","4.0","grams"]
[null,null,null,null,null,null,null,null,null,null,null,null,null,null,null,null,null,null,null,"F113","P23","Numeric","TSR Weight (g)","4.0","grams"]
[null,null,null,null,null,null,null,null,null,null,null,null,null,null,null,null,null,null,null,"F114","P24","Numeric","% TSR without additive","2.0","%"]
[null,null,null,null,null,null,null,null,null,null,null,null,null,null,null,null,null,null,null,"F115","P25","Numeric","% TSR with additive","2.0","%"]
[null,null,null,null,null,null,null,null,null,null,null,null,null,null,null,null,null,null,null,"F116","P26","Numeric","% Additive","1.2","%"]
[null,null,null,null,null,null,null,null,null,null,null,null,null,null,null,null,null,null,null,"F117","P27","Alphanumeric","Type of Additive",15,"N/A"]
[null,null,null,null,null,null,null,null,null,null,null,null,null,null,null,null,null,null,null,"F118","Q3","Label","Criteria",20,"N/A"]
[null,null,null,null,null,null,null,null,null,null,null,null,null,null,null,null,null,null,null,"F119","Q4","Alphanumeric","Criteria - Coarse Aggregate Angularity (%)",20,"N/A"]
[null,null,null,null,null,null,null,null,null,null,null,null,null,null,null,null,null,null,null,"F120","Q5","Alphanumeric","Criteria - Fine Aggregate Angularity (%)",20,"N/A"]
[null,null,null,null,null,null,null,null,null,null,null,null,null,null,null,null,null,null,null,"F121","Q6","Alphanumeric","Criteria - Flat & Elongated Particles (%)",20,"N/A"]
[null,null,null,null,null,null,null,null,null,null,null,null,null,null,null,null,null,null,null,"F122","Q7","Alphanumeric","Criteria - Clay Content (SE) (%)",20,"N/A"]
[null,null,null,null,null,null,null,null,null,null,null,null,null,null,null,null,null,null,null,"F123","Q8","Alphanumeric","Criteria - % VFA",20,"N/A"]
[null,null,null,null,null,null,null,null,null,null,null,null,null,null,null,null,null,null,null,"F124","Q9","Alphanumeric","Criteria - % VMA",20,"N/A"]
[null,null,null,null,null,null,null,null,null,null,null,null,null,null,null,null,null,null,null,"F125","Q10","Alphanumeric","Criteria - D/A Ratio",20,"N/A"]
[null,null,null,null,null,null,null,null,null,null,null,null,null,null,null,null,null,null,null,"F126","Q11","Alphanumeric","Criteria - % Gmm @ Ninitial",20,"N/A"]
[null,null,null,null,null,null,null,null,null,null,null,null,null,null,null,null,null,null,null,"F127","Q12","Alphanumeric","Criteria - % Gmm @ Nmax",20,"N/A"]
[null,null,null,null,null,null,null,null,null,null,null,null,null,null,null,null,null,null,null,"F128","Q13","Alphanumeric","Criteria - % Air Voids",20,"N/A"]
[null,null,null,null,null,null,null,null,null,null,null,null,null,null,null,null,null,null,null,"F129","Q15","Alphanumeric","Criteria - % AC",20,"N/A"]
[null,null,null,null,null,null,null,null,null,null,null,null,null,null,null,null,null,null,null,"F130","Q24","Alphanumeric","Criteria - % TSR without additive",20,"N/A"]
[null,null,null,null,null,null,null,null,null,null,null,null,null,null,null,null,null,null,null,"F131","Q25","Alphanumeric","Criteria - % TSR with additive",20,"N/A"]
[null,null,null,null,null,null,null,null,null,null,null,null,null,null,null,null,null,null,null,"F132","B22","Label","Reference Information","N/A","N/A"]
[null,null,null,null,null,null,null,null,null,null,null,null,null,null,null,null,null,null,null,"F133","B29","Alphanumeric","Additional Reference Information",60,"N/A"]
[null,null,null,null,null,null,null,null,null,null,null,null,null,null,null,null,null,null,null,"F134","C23","Alphanumeric","COUNTY:",50,"N/A"]
[null,null,null,null,null,null,null,null,null,null,null,null,null,null,null,null,null,null,null,"F135","C24","Alphanumeric","ID#:",50,"N/A"]
[null,null,null,null,null,null,null,null,null,null,null,null,null,null,null,null,null,null,null,"F136","C25","Alphanumeric","Binder:",50,"N/A"]
[null,null,null,null,null,null,null,null,null,null,null,null,null,null,null,null,null,null,null,"F137","D26","Numeric","Date Released:","8.0","N/A","FORMAT: MMDDYYYY"]
[null,null,null,null,null,null,null,null,null,null,null,null,null,null,null,null,null,null,null,"F138","D27","Alphanumeric","Design AC%:","5","%"]
[null,null,null,null,null,null,null,null,null,null,null,null,null,null,null,null,null,null,null,"F139","D28","Alphanumeric","Job Complete?","5","N/A"]
[null,null,null,null,null,null,null,null,null,null,null,null,null,null,null,null,null,null,null,"F140","B31","Label","RAP Information","N/A","N/A"]
[null,null,null,null,null,null,null,null,null,null,null,null,null,null,null,null,null,null,null,"F141","D32","Numeric","% AC in RAP:","2.1","%"]
[null,null,null,null,null,null,null,null,null,null,null,null,null,null,null,null,null,null,null,"F142","D33","Numeric","% Virgin AC in mix:","2.1","%"]
[null,null,null,null,null,null,null,null,null,null,null,null,null,null,null,null,null,null,null,"F143","D34","Numeric","% RAP AC in mix:","2.1","%"]
[null,null,null,null,null,null,null,null,null,null,null,null,null,null,null,null,null,null,null,"F144","D35","Numeric","Total % AC in mix:","2.1","%"]
[null,null,null,null,null,null,null,null,null,null,null,null,null,null,null,null,null,null,null,"F145","C36","Alphanumeric","RAP MSG's",5,"N/A"]
[null,null,null,null,null,null,null,null,null,null,null,null,null,null,null,null,null,null,null,"F254","C37","Alphanumeric","RAP Gsb field \"label\"","9","N/A"]
[null,null,null,null,null,null,null,null,null,null,null,null,null,null,null,null,null,null,null,"F146","D36","Alphanumeric","RAP MSG's (2)",5,"N/A"]
[null,null,null,null,null,null,null,null,null,null,null,null,null,null,null,null,null,null,null,"F147","D37","Numeric","RAP Gsb =","1.2","N/A"]
[null,null,null,null,null,null,null,null,null,null,null,null,null,null,null,null,null,null,null,"F148","F22","Label","APPROVAL INFORMATION","N/A","N/A"]
[null,null,null,null,null,null,null,null,null,null,null,null,null,null,null,null,null,null,null,"F149","H23","Alphanumeric","Complete SGC Des.",1,"N/A"]
[null,null,null,null,null,null,null,null,null,null,null,null,null,null,null,null,null,null,null,"F150","H24","Alphanumeric","App.-New Design",1,"N/A"]
[null,null,null,null,null,null,null,null,null,null,null,null,null,null,null,null,null,null,null,"F151","H25","Alphanumeric","MCL Design",1,"N/A"]
[null,null,null,null,null,null,null,null,null,null,null,null,null,null,null,null,null,null,null,"F152","K23","Alphanumeric","1-Pt. SGC Des.",1,"N/A"]
[null,null,null,null,null,null,null,null,null,null,null,null,null,null,null,null,null,null,null,"F153","K24","Alphanumeric","App.-Ref. Mix",1,"N/A"]
[null,null,null,null,null,null,null,null,null,null,null,null,null,null,null,null,null,null,null,"F154","K25","Alphanumeric","Contr. Design",1,"N/A"]
[null,null,null,null,null,null,null,null,null,null,null,null,null,null,null,null,null,null,null,"F155","K26","Alphanumeric","Revised Asphalt Content (+ or - 0.3%):",5,"%"]
[null,null,null,null,null,null,null,null,null,null,null,null,null,null,null,null,null,null,null,"F156","F29","Label","TSR INFORMATION","N/A","N/A"]
[null,null,null,null,null,null,null,null,null,null,null,null,null,null,null,null,null,null,null,"F157","F31","Numeric","%AC:","2.1","%"]
[null,null,null,null,null,null,null,null,null,null,null,null,null,null,null,null,null,null,null,"F158","G31","Alphanumeric","% ADDITIVE:",5,"%"]
[null,null,null,null,null,null,null,null,null,null,null,null,null,null,null,null,null,null,null,"F159","I31","Alphanumeric","TYPE OF ADDITIVE:",30,"N/A"]
[null,null,null,null,null,null,null,null,null,null,null,null,null,null,null,null,null,null,null,"F160","H32","Numeric","% Air Voids w/o add.","2.1","%"]
[null,null,null,null,null,null,null,null,null,null,null,null,null,null,null,null,null,null,null,"F161","H33","Numeric","% Initial Saturation w/o Add.","2.1","%"]
[null,null,null,null,null,null,null,null,null,null,null,null,null,null,null,null,null,null,null,"F162","H34","Numeric","% Final Saturation w/o Add.","3.1","%"]
[null,null,null,null,null,null,null,null,null,null,null,null,null,null,null,null,null,null,null,"F163","H35","Numeric","Wet Strength w/o add. (psi)","3.1","%"]
[null,null,null,null,null,null,null,null,null,null,null,null,null,null,null,null,null,null,null,"F164","H36","Numeric","Dry Strength w/o add. (psi)","3.1","psi"]
[null,null,null,null,null,null,null,null,null,null,null,null,null,null,null,null,null,null,null,"F165","H37","Numeric","% TSR w/o Add. = ","2.0","psi"]
[null,null,null,null,null,null,null,null,null,null,null,null,null,null,null,null,null,null,null,"F166","K32","Numeric","% Air Voids with add.","2.1","%"]
[null,null,null,null,null,null,null,null,null,null,null,null,null,null,null,null,null,null,null,"F167","K33","Numeric","% Initial Saturation with Add.","2.1","%"]
[null,null,null,null,null,null,null,null,null,null,null,null,null,null,null,null,null,null,null,"F168","K34","Numeric","% Final Saturation with Add.","3.1","%"]
[null,null,null,null,null,null,null,null,null,null,null,null,null,null,null,null,null,null,null,"F169","K35","Numeric","Wet Strength with add. (psi)","3.1","psi"]
[null,null,null,null,null,null,null,null,null,null,null,null,null,null,null,null,null,null,null,"F170","K36","Numeric","Dry Strength with add. (psi)","3.1","psi"]
[null,null,null,null,null,null,null,null,null,null,null,null,null,null,null,null,null,null,null,"F171","K37","Numeric","% TSR with Add. = ","2.0","%"]
[null,null,null,null,null,null,null,null,null,null,null,null,null,null,null,null,null,null,null,"F172","B39","Label","MIX DESIGN AGGREGATE INFORMATION","N/A","N/A"]
[null,null,null,null,null,null,null,null,null,null,null,null,null,null,null,null,null,null,null,"F173","B41","Alphanumeric","AGG. PROD. NO.",10,"N/A"]
[null,null,null,null,null,null,null,null,null,null,null,null,null,null,null,null,null,null,null,"F174","B42","Alphanumeric","AGG. PROD. NO. #2",10,"N/A"]
[null,null,null,null,null,null,null,null,null,null,null,null,null,null,null,null,null,null,null,"F175","B43","Alphanumeric","AGG. PROD. NO. #3",10,"N/A"]
[null,null,null,null,null,null,null,null,null,null,null,null,null,null,null,null,null,null,null,"F176","B44","Alphanumeric","AGG. PROD. NO. #4",10,"N/A"]
[null,null,null,null,null,null,null,null,null,null,null,null,null,null,null,null,null,null,null,"F177","B45","Alphanumeric","AGG. PROD. NO. #5",10,"N/A"]
[null,null,null,null,null,null,null,null,null,null,null,null,null,null,null,null,null,null,null,"F178","B46","Alphanumeric","AGG. PROD. NO. #6",10,"N/A"]
[null,null,null,null,null,null,null,null,null,null,null,null,null,null,null,null,null,null,null,"F179","D41","Alphanumeric","PRODUCER NAME",75,"N/A"]
[null,null,null,null,null,null,null,null,null,null,null,null,null,null,null,null,null,null,null,"F180","D42","Alphanumeric","PRODUCER NAME #2",75,"N/A"]
[null,null,null,null,null,null,null,null,null,null,null,null,null,null,null,null,null,null,null,"F181","D43","Alphanumeric","PRODUCER NAME #3",75,"N/A"]
[null,null,null,null,null,null,null,null,null,null,null,null,null,null,null,null,null,null,null,"F182","D44","Alphanumeric","PRODUCER NAME #4",75,"N/A"]
[null,null,null,null,null,null,null,null,null,null,null,null,null,null,null,null,null,null,null,"F183","D45","Alphanumeric","PRODUCER NAME #5",75,"N/A"]
[null,null,null,null,null,null,null,null,null,null,null,null,null,null,null,null,null,null,null,"F184","D46","Alphanumeric","PRODUCER NAME #6",75,"N/A"]
[null,null,null,null,null,null,null,null,null,null,null,null,null,null,null,null,null,null,null,"F185","I41","Alphanumeric","MAT.CODE",10,"N/A"]
[null,null,null,null,null,null,null,null,null,null,null,null,null,null,null,null,null,null,null,"F186","I42","Alphanumeric","MAT.CODE #2",10,"N/A"]
[null,null,null,null,null,null,null,null,null,null,null,null,null,null,null,null,null,null,null,"F187","I43","Alphanumeric","MAT.CODE #3",10,"N/A"]
[null,null,null,null,null,null,null,null,null,null,null,null,null,null,null,null,null,null,null,"F188","I44","Alphanumeric","MAT.CODE #4",10,"N/A"]
[null,null,null,null,null,null,null,null,null,null,null,null,null,null,null,null,null,null,null,"F189","I45","Alphanumeric","MAT.CODE #5",10,"N/A"]
[null,null,null,null,null,null,null,null,null,null,null,null,null,null,null,null,null,null,null,"F190","I46","Alphanumeric","MAT.CODE #6",10,"N/A"]
[null,null,null,null,null,null,null,null,null,null,null,null,null,null,null,null,null,null,null,"F191","K41","Alphanumeric","AGG. TYPE",25,"N/A"]
[null,null,null,null,null,null,null,null,null,null,null,null,null,null,null,null,null,null,null,"F192","K42","Alphanumeric","AGG. TYPE #2",25,"N/A"]
[null,null,null,null,null,null,null,null,null,null,null,null,null,null,null,null,null,null,null,"F193","K43","Alphanumeric","AGG. TYPE #3",25,"N/A"]
[null,null,null,null,null,null,null,null,null,null,null,null,null,null,null,null,null,null,null,"F194","K44","Alphanumeric","AGG. TYPE #4",25,"N/A"]
[null,null,null,null,null,null,null,null,null,null,null,null,null,null,null,null,null,null,null,"F195","K45","Alphanumeric","AGG. TYPE #5",25,"N/A"]
[null,null,null,null,null,null,null,null,null,null,null,null,null,null,null,null,null,null,null,"F196","K46","Alphanumeric","AGG. TYPE #6",25,"N/A"]
[null,null,null,null,null,null,null,null,null,null,null,null,null,null,null,null,null,null,null,"F197","M41","Numeric","Gsb","1.2","N/A"]
[null,null,null,null,null,null,null,null,null,null,null,null,null,null,null,null,null,null,null,"F198","M42","Numeric","Gsb #2","1.2","N/A"]
[null,null,null,null,null,null,null,null,null,null,null,null,null,null,null,null,null,null,null,"F199","M43","Numeric","Gsb #3","1.2","N/A"]
[null,null,null,null,null,null,null,null,null,null,null,null,null,null,null,null,null,null,null,"F200","M44","Numeric","Gsb #4","1.2","N/A"]
[null,null,null,null,null,null,null,null,null,null,null,null,null,null,null,null,null,null,null,"F201","M45","Numeric","Gsb #5","1.2","N/A"]
[null,null,null,null,null,null,null,null,null,null,null,null,null,null,null,null,null,null,null,"F202","M46","Numeric","Gsb #6","1.2","N/A"]
[null,null,null,null,null,null,null,null,null,null,null,null,null,null,null,null,null,null,null,"F203","N41","Numeric","%","3.0","%"]
[null,null,null,null,null,null,null,null,null,null,null,null,null,null,null,null,null,null,null,"F204","N42","Numeric","% #2","3.0","%"]
[null,null,null,null,null,null,null,null,null,null,null,null,null,null,null,null,null,null,null,"F205","N43","Numeric","% #3","3.0","%"]
[null,null,null,null,null,null,null,null,null,null,null,null,null,null,null,null,null,null,null,"F206","N44","Numeric","% #4","3.0","%"]
[null,null,null,null,null,null,null,null,null,null,null,null,null,null,null,null,null,null,null,"F207","N45","Numeric","% #5","3.0","%"]
[null,null,null,null,null,null,null,null,null,null,null,null,null,null,null,null,null,null,null,"F208","N46","Numeric","% #6","3.0","%"]
[null,null,null,null,null,null,null,null,null,null,null,null,null,null,null,null,null,null,null,"F209","O41","Alphanumeric","S/C",1,"N/A"]
[null,null,null,null,null,null,null,null,null,null,null,null,null,null,null,null,null,null,null,"F210","O42","Alphanumeric","AGG S/C #2",1,"N/A"]
[null,null,null,null,null,null,null,null,null,null,null,null,null,null,null,null,null,null,null,"F211","O43","Alphanumeric","AGG S/C #3",1,"N/A"]
[null,null,null,null,null,null,null,null,null,null,null,null,null,null,null,null,null,null,null,"F212","O44","Alphanumeric","AGG S/C #4",1,"N/A"]
[null,null,null,null,null,null,null,null,null,null,null,null,null,null,null,null,null,null,null,"F213","O45","Alphanumeric","AGG S/C #5",1,"N/A"]
[null,null,null,null,null,null,null,null,null,null,null,null,null,null,null,null,null,null,null,"F214","O46","Alphanumeric","AGG S/C #6",1,"N/A"]
[null,null,null,null,null,null,null,null,null,null,null,null,null,null,null,null,null,null,null,"F215","P41","Alphanumeric","SiteManager Agg. Sample ID #",18,"N/A"]
[null,null,null,null,null,null,null,null,null,null,null,null,null,null,null,null,null,null,null,"F216","P42","Alphanumeric","SiteManager Agg. Sample ID #2",18,"N/A"]
[null,null,null,null,null,null,null,null,null,null,null,null,null,null,null,null,null,null,null,"F217","P43","Alphanumeric","SiteManager Agg. Sample ID #3",18,"N/A"]
[null,null,null,null,null,null,null,null,null,null,null,null,null,null,null,null,null,null,null,"F218","P44","Alphanumeric","SiteManager Agg. Sample ID #4",18,"N/A"]
[null,null,null,null,null,null,null,null,null,null,null,null,null,null,null,null,null,null,null,"F219","P45","Alphanumeric","SiteManager Agg. Sample ID #5",18,"N/A"]
[null,null,null,null,null,null,null,null,null,null,null,null,null,null,null,null,null,null,null,"F220","P46","Alphanumeric","SiteManager Agg. Sample ID #6",18,"N/A"]
[null,null,null,null,null,null,null,null,null,null,null,null,null,null,null,null,null,null,null,"F221","B48","Label","1-Pt. CHECK PROPERTIES","N/A","N/A"]
[null,null,null,null,null,null,null,null,null,null,null,null,null,null,null,null,null,null,null,"F222","D49","Numeric","Unit Wt. (lb/ft3) =","3.1","lbs/ft3"]
[null,null,null,null,null,null,null,null,null,null,null,null,null,null,null,null,null,null,null,"F223","D50","Numeric","% Air Voids =","2.1","%"]
[null,null,null,null,null,null,null,null,null,null,null,null,null,null,null,null,null,null,null,"F224","D51","Numeric","% VFA =","2.1","%"]
[null,null,null,null,null,null,null,null,null,null,null,null,null,null,null,null,null,null,null,"F225","D52","Numeric","Gsb =","1.2","N/A"]
[null,null,null,null,null,null,null,null,null,null,null,null,null,null,null,null,null,null,null,"F226","F49","Numeric","D/A Ratio =","1.1","N/A"]
[null,null,null,null,null,null,null,null,null,null,null,null,null,null,null,null,null,null,null,"F227","F50","Numeric","Gmm =","1.3","N/A"]
[null,null,null,null,null,null,null,null,null,null,null,null,null,null,null,null,null,null,null,"F228","F51","Numeric","% Eff. AC =","2.1","%"]
[null,null,null,null,null,null,null,null,null,null,null,null,null,null,null,null,null,null,null,"F229","F52","Numeric","Gse =","1.3","N/A"]
[null,null,null,null,null,null,null,null,null,null,null,null,null,null,null,null,null,null,null,"F230","I49","Numeric","AC (%) =","2.1","%"]
[null,null,null,null,null,null,null,null,null,null,null,null,null,null,null,null,null,null,null,"F231","I50","Numeric","% VMA =","2.1","%"]
[null,null,null,null,null,null,null,null,null,null,null,null,null,null,null,null,null,null,null,"F232","I51","Numeric","% Abs. AC (Mix) =","1.2","%"]
[null,null,null,null,null,null,null,null,null,null,null,null,null,null,null,null,null,null,null,"F233","I52","Alphanumeric","ESAL Class",5,"N/A"]
[null,null,null,null,null,null,null,null,null,null,null,null,null,null,null,null,null,null,null,"F234","L48","Label","MCL CONSENSUS (& ADDITIONAL) VERIFICATION INFORMATION","N/A","N/A"]
[null,null,null,null,null,null,null,null,null,null,null,null,null,null,null,null,null,null,null,"F235","L50","Alphanumeric","TEST TYPE",50,"N/A"]
[null,null,null,null,null,null,null,null,null,null,null,null,null,null,null,null,null,null,null,"F236","L51","Alphanumeric","TEST TYPE #2",50,"N/A"]
[null,null,null,null,null,null,null,null,null,null,null,null,null,null,null,null,null,null,null,"F237","L52","Alphanumeric","TEST TYPE #3",50,"N/A"]
[null,null,null,null,null,null,null,null,null,null,null,null,null,null,null,null,null,null,null,"F238","L53","Alphanumeric","TEST TYPE #4",50,"N/A"]
[null,null,null,null,null,null,null,null,null,null,null,null,null,null,null,null,null,null,null,"F239","L54","Alphanumeric","TEST TYPE #5",50,"N/A"]
[null,null,null,null,null,null,null,null,null,null,null,null,null,null,null,null,null,null,null,"F240","L55","Alphanumeric","TEST TYPE #6",50,"N/A"]
[null,null,null,null,null,null,null,null,null,null,null,null,null,null,null,null,null,null,null,"F241","O50","Alphanumeric","S/C",1,"N/A"]
[null,null,null,null,null,null,null,null,null,null,null,null,null,null,null,null,null,null,null,"F242","O51","Alphanumeric","MCL S/C #2",1,"N/A"]
[null,null,null,null,null,null,null,null,null,null,null,null,null,null,null,null,null,null,null,"F243","O52","Alphanumeric","MCL S/C #3",1,"N/A"]
[null,null,null,null,null,null,null,null,null,null,null,null,null,null,null,null,null,null,null,"F244","O53","Alphanumeric","MCL S/C #4",1,"N/A"]
[null,null,null,null,null,null,null,null,null,null,null,null,null,null,null,null,null,null,null,"F245","O54","Alphanumeric","MCL S/C #5",1,"N/A"]
[null,null,null,null,null,null,null,null,null,null,null,null,null,null,null,null,null,null,null,"F246","O55","Alphanumeric","MCL S/C #6",1,"N/A"]
[null,null,null,null,null,null,null,null,null,null,null,null,null,null,null,null,null,null,null,"F247","P50","Alphanumeric","SiteManager Sample ID #",18,"N/A"]
[null,null,null,null,null,null,null,null,null,null,null,null,null,null,null,null,null,null,null,"F248","P51","Alphanumeric","SiteManager Sample ID #2",18,"N/A"]
[null,null,null,null,null,null,null,null,null,null,null,null,null,null,null,null,null,null,null,"F249","P52","Alphanumeric","SiteManager Sample ID #3",18,"N/A"]
[null,null,null,null,null,null,null,null,null,null,null,null,null,null,null,null,null,null,null,"F250","P53","Alphanumeric","SiteManager Sample ID #4",18,"N/A"]
[null,null,null,null,null,null,null,null,null,null,null,null,null,null,null,null,null,null,null,"F251","P54","Alphanumeric","SiteManager Sample ID #5",18,"N/A"]
[null,null,null,null,null,null,null,null,null,null,null,null,null,null,null,null,null,null,null,"F252","P55","Alphanumeric","SiteManager Sample ID #6",18,"N/A","Assume this is the BINDER Sample"]
[null,null,null,null,null,null,null,null,null,null,null,null,null,null,null,null,null,null,null,"F253","M32","Numeric","TOTAL UNIT TEST COST",11.2,"$"]

{"sheet":"t_smpl","index":18,"n_rows":8,"n_cols":55,"rows_kept":8,"cut":false,"hidden":true,"merged":[]}
["Special Processing",null,null,null,"d",null,"c","c",null,"c","d",null,null,null,"c","c",null,"c",null,null,null,null,null,null,"c",null,"c","c","c","c","c","c",null,"c","c","c","c",null,"c","c","c","c","c","c","c","c","c","c","c","c","c","c","c","c","c"]
["SM Table","t_smpl","t_smpl","t_smpl","t_smpl","t_smpl","t_smpl","t_smpl","t_smpl","t_smpl","t_smpl","t_smpl","t_smpl","t_smpl","t_smpl","t_smpl","t_smpl","t_smpl","t_smpl","t_smpl","t_smpl","t_smpl","t_smpl","t_smpl","t_smpl","t_smpl","t_smpl","t_smpl","t_smpl","t_smpl","t_smpl","t_smpl","t_smpl","t_smpl","t_smpl","t_smpl","t_smpl","t_smpl","t_smpl","t_smpl","t_smpl","t_smpl","t_smpl","t_smpl","t_smpl","t_smpl","t_smpl","t_smpl","t_smpl","t_smpl","t_smpl","t_smpl","t_smpl","t_smpl","t_smpl"]
["SM Column","smpl_id","acpt_meth_t","auth_by_cms_uid","auth_dt","cms_uid","cntrl_nbr","cntrl_t","geog_area_t","intd_use_txt","last_modfd_dt","last_modfd_uid","log_dt","matl_cd","offst","plant_id","prodr_supp_cd","rel_smpl_id","rmrks_id","smpl_dsn_t","smpl_dt","smpl_mix_id","smpl_t","smpld_by","sta","stat_t","witnes_by_cms_uid","prod_nm","plant_t","revise_smpl_id","smpl_origin","smpld_fr_txt","unt_t","mnfctr_cd","twn","buy_usa_ind","buy_usa_rqrdmt_t","repr_qty","ref","seal_nbr","smpl_sz","reqst_by_nm","std_rmrks_ind","smpl_lock_ind","dstnc_fnsh_grd","dstnc_fnsh_grd_unt","ref_doc","sz_unt_t","lock_type","locked_by","lock_dt","lev1_office_ind","lev2_office_nbr","lev3_office_nbr","lev4_office_nbr"]
["Logical Validation","No duplicates of key (highlighted in yellow);\n\nIF Sample ID \"blank\", THEN skip to next record","Existing on t_cd_tbl_dtl (cd_id)\nAND t_cd_tbl_dtl.tbl_id='ACPTMETH'","Existing on t_matl_user \nAND  t_matl_user.smplr_ind='Y\"\nAND  active sampler qualification of \"Superpave Mix Design Tech.\" \n        (  I.e., At least one row returned from:\n         SELECT * FROM t_insp_qualfn\n         WHERE smpld_by = smpld_by\n         AND      insp_qualfn_t = \"ASMD\"\n         AND      qualfn_lev_t = \"SMDT\"\n         AND      exp_dt >= t_smpl.smpl_dt (same keys as current row)\n         AND      effdt     <= t_smpl.smpl_dt (same keys as current row)   )\n         ","IF new record THEN\n   Set to Current System Date\nELSE (using REPLACE feature)\n   Set to auth_dt on exisitng t_smp record in SM DB\nENDIF","Existing on t_matl_user \nAND t_matl_user.sm_user_ind='Y'",null,null,"Existing on t_cd_tbl_dtl (cd_id)\nAND t_cd_tbl_dtl.tbl_id='GEOGAREA'",null,null,null,null,"Existing on t_matl\nAND t.matl_actvty_stat_t = \"A\"",null,null,"Existing on t_prodr_supp\nAND t_prodr_supp.actvty_stat_t = \"A\"\nAND smpl_dt (below) is between \n            t_prodr_supp_matl.effdt & exp_dt\n            (for the matl_cd above)",null,null,"Existing on t_cd_tbl_dtl (cd_id)\nAND t_cd_tbl_dtl.tbl_id='SMPLDSN'",null,null,"Existing on t_cd_tbl_dtl (cd_id)\nAND t_cd_tbl_dtl.tbl_id='SMPLTYPE'","Existing on t_matl_user \nAND  t_matl_user.smplr_ind='Y\"\nAND  active sampler qualification of \"Superpave Mix Design Tech.\" \n        (  I.e., At least one row returned from:\n         SELECT * FROM t_insp_qualfn\n         WHERE smpld_by = smpld_by\n         AND      insp_qualfn_t = \"ASMD\"\n         AND      qualfn_lev_t = \"SMDT\"\n         AND      exp_dt >= t_smpl.smpl_dt (same keys as current row)\n         AND      effdt     <= t_smpl.smpl_dt (same keys as current row)   )\n         ",null,"Existing on t_cd_tbl_dtl (cd_id)\nAND t_cd_tbl_dtl.tbl_id='SMPLSTAT'",null,null,null,null,null,null,"Existing on t_cd_tbl_dtl (cd_id)\nAND t_cd_tbl_dtl.tbl_id='UNITS'"]
["Comment",null,"Embed code table in spreadsheet","The Approver must have active \"SUPERPAVE MIX DESIGN TECHNOLOGIST\" Sampler qualification (and therefore have a SM User ID) for a Material Category of \"ASPHALT-MIX DESIGN\".",null,"SM User ID from Header","Not Used\nInitialized to \" \" (i.e., space)","Not Used\nInitialized to \" \" (i.e., space)","Derived from first two characters of Sample ID","Not Used\nInitialized to \" \" (i.e., space)","Current system date",null,"The Date Received should be updated each time the spreadsheet received, i.e., including corrections.",null,"Not Used\nInitialized to \" \" (i.e., space)","Not Used\nInitialized to \" \" (i.e., space)",null,"Not Used\nInitialized to \" \" (i.e., space)","Comes from t_rmks_dtl tab\n(Only QC & QA have active remarks - not active for INFO Samples)",null,"This will be the date when the Contractor submitted the spreadsheet.",null,null,"The Approver must have active \"SUPERPAVE MIX DESIGN TECHNOLOGIST\" Sampler qualification (and therefore have a SM User ID) for a Material Category of \"ASPHALT-MIX DESIGN\".","Not Used\nInitialized to \" \" (i.e., space)",null,"Not Used\nInitialized to \" \" (i.e., space)","Not Used\nInitialized to \" \" (i.e., space)","Not Used\nInitialized to \" \" (i.e., space)","Not Used\nInitialized to \" \" (i.e., space)","Not Used\nInitialized to \" \" (i.e., space)","Not Used\nInitialized to \" \" (i.e., space)","Always assigned as TONS for this discipline","Not Used\nInitialized to \" \" (i.e., space)","Not Used\nInitialized to \" \" (i.e., space)","Not Used\nInitialized to \" \" (i.e., space)","Not Used\nInitialized to \" \" (i.e., space)",null,"Not Used\nInitialized to \" \" (i.e., space)","Not Used\nInitialized to \" \" (i.e., space)","Not Used\nInitialized to \" \" (i.e., space)","Not Used\nInitialized to \" \" (i.e., space)","Not Used\nInitialized to \" \" (i.e., space)","Not Used\nInitialized to \" \" (i.e., space)","Not Used\nInitialized to \" \" (i.e., space)","Not Used\nInitialized to \" \" (i.e., space)","Not Used\nInitialized to \" \" (i.e., space)","Not Used\nInitialized to \" \" (i.e., space)","Not Used\nInitialized to \" \" (i.e., space)","Not Used\nInitialized to \" \" (i.e., space)","Not Used\nInitialized to \"\" (i.e., NULL)","Not Used\nInitialized to \" \" (i.e., space)","Not Used\nInitialized to \" \" (i.e., space)","Not Used\nInitialized to \" \" (i.e., space)","Not Used\nInitialized to \" \" (i.e., space)"]
["Long Description","SiteManager \nSample ID ","Acceptance Method","Authorizer SM User ID","Authorization Date","Sample \"Creator\" \nSM User ID","Control Number","Control Type","Geographic Area","Intended Use (of material sampled)","Last Modified Date","Last Modified User ID","Sample Logged Date","Material Code","Offset","Plant ID","Producer / Supplier","Related Sample ID","Remarks ID","Mix Design Type","Sample Date","Mix ID","Sample Type","Sampling Technician (SM User ID)","Station","Sample Status","Sampling KYTC Witness SM User ID ","Product Name","Plant Type","Revised Sample ID","Sample Origin","Sample From","Repr Material Quantity Units","Manufacturer","Town (where sampled)","Buy USA Indicator","Buy USA Requirement Type","Represented Material Quantity","Reference","Sublot Sample","Sample Size","Name of Sample Requester","Standard Remarks Included Indicator","Sample Locked Indicator","Distance From Finished Grade","Distance From Finished Grade Unit","Reference Document","Sample Size Unit","Sample Lock Type","Sample Locked By (SM User ID)","Sample Lock Date","Sample Lock Level 1 Office","Sample Lock Level 2 Office","Sample Lock Level 3 Office","Sample Lock Level 4 Office"]
["User Entry                                     XML Schema \nSheet Map                                   Column Name","smpl_id","acpt_meth_t","auth_by_cms_uid","auth_dt","cms_uid","cntrl_nbr","cntrl_t","geog_area_t","intd_use_txt","last_modfd_dt","last_modfd_uid","log_dt","matl_cd","offst","plant_id","prodr_supp_cd","rel_smpl_id","rmrks_id","smpl_dsn_t","smpl_dt","smpl_mix_id","smpl_t","smpld_by","sta","stat_t","witnes_by_cms_uid","prod_nm","plant_t","revise_smpl_id","smpl_origin","smpld_fr_txt","unt_t","mnfctr_cd","twn","buy_usa_ind","buy_usa_rqrdmt_t","repr_qty","ref","seal_nbr","smpl_sz","reqst_by_nm","std_rmrks_ind","smpl_lock_ind","dstnc_fnsh_grd","dstnc_fnsh_grd_unt","ref_doc","sz_unt_t","lock_type","locked_by","lock_dt","lev1_office_ind","lev2_office_nbr","lev3_office_nbr","lev4_office_nbr"]
[null,{"$f":"'Design Data'!C10","v":0},"MDA",{"$f":"'Design Data'!S82","v":0},{"$f":"'Design Data'!H16","v":"00:00:00"},{"$f":"'Design Data'!S82","v":0}," "," ",{"$f":"LEFT('Design Data'!C10,2)","v":""}," ",null,{"$f":"'Design Data'!S82","v":0},{"$f":"'Design Data'!H14","v":"00:00:00"},{"$f":"'Design Data'!Q16","v":""}," "," ",{"$f":"'Design Data'!Q14","v":{"$error":"#N/A"}}," ",{"$f":"t_rmks_dtl!B8","v":""},"SUP",{"$f":"'Design Data'!H16","v":"00:00:00"},{"$f":"'Design Data'!H10","v":0},"MDA",{"$f":"'Design Data'!K16","v":0}," ","COMP"," "," "," "," "," "," ","TON"," "," "," "," ",{"$f":"'Design Data'!Q12","v":0}," "," "," "," ",null," "," "," "," "," "," "," ",null," "," "," "," "]

{"sheet":"t_cont_smpl","index":19,"n_rows":8,"n_cols":8,"rows_kept":8,"cut":false,"hidden":true,"merged":[[3,2,3,4]]}
["Special Processing","x",null,null,null,null,null,"d"]
["SM Table","t_cont_smpl","t_cont_smpl","t_cont_smpl","t_cont_smpl","t_cont_smpl","t_cont_smpl","t_cont_smpl"]
["SM Column","smpl_id","cont_id","prj_nbr","ln_itm_nbr","repr_qty","last_modfd_uid","last_modfd_dt"]
["Logical Validation","No duplicates of key (highlighted in yellow);\n\nIF Sample ID \"blank\", THEN skip to next record","These three keys (and matl_cd from Header tab) must exist on t_cont_streq_matl."]
["Comment",null,null,"THESE THREE FIELDS COME FROM THE FIRST THREE COLUMNS ON THE \"Project Item\" TAB \n(AND EACH ROW ON THAT TAB REPEATS FOR EVERY ROW ON THIS TAB HAVING A \"Sample ID\")",null,null,null,"Current system date"]
["Long Description","SiteManager \nSample ID ","Contract ID","Project Number","Line Item Number","Represented Quantity","Last Modified User ID","Last Modified Date"]
["User Entry                                     XML Schema \nSheet Map                                   Column Name","smpl_id","cont_id","prj_nbr","ln_itm_nbr","repr_qty","last_modfd_uid","last_modfd_dt"]
[null,{"$f":"'Design Data'!C10","v":0},{"$f":"'Design Data'!C8","v":0},"N/A","N/A","N/A",{"$f":"'Design Data'!S82","v":0}]

{"sheet":"t_rmks_dtl","index":20,"n_rows":8,"n_cols":7,"rows_kept":8,"cut":false,"hidden":true,"merged":[]}
["Special Processing",null,null,null,null,null,"d"]
["SM Table","t_rmrks_dtl","t_rmrks_dtl","t_rmrks_dtl","t_rmrks_dtl","t_rmrks_dtl","t_rmrks_dtl"]
["SM Column","rmrks_id","rmrks_t","rmrks_sn","rmrks_txt_fld","last_modfd_uid","last_modfd_dt"]
["Logical Validation","No duplicates of key (highlighted in yellow);\n\nIF Sample ID \"blank\", THEN skip to next record"]
["Comment",null,null,null,"Up to 254 char Sample Remark  \n(NOTE: COULD HAVE REMARK FOR EACH TEST.)",null,"Current system date"]
["Long Description","Remark ID","Remark Type","Remark Sequence Number","Remarks","Last Modified User ID","Last Modified Date"]
["User Entry                                     XML Schema \nSheet Map                                   Column Name","rmrks_id","rmrks_t","rmrks_sn","rmrks_txt_fld","last_modfd_uid","last_modfd_dt"]
[null,{"$f":"IF(E8=0,\"\",CONCATENATE('Design Data'!S82,TEXT(NOW(),\"yyyymmddhhmmss\"),RIGHT('Design Data'!C10,4)))","v":""},"GEN",1,{"$f":"'Design Data'!A121","v":0},{"$f":"'Design Data'!S82","v":0}]

{"sheet":"t_smpl_tst","index":21,"n_rows":8,"n_cols":11,"rows_kept":8,"cut":false,"hidden":true,"merged":[]}
["Special Processing",null,null,null,null,null,null,null,null,null,"d"]
["SM Table","t_smpl_tst","t_smpl_tst","t_smpl_tst","t_smpl_tst","t_smpl_tst","t_smpl_tst","t_smpl_tst","t_smpl_tst","t_smpl_tst","t_smpl_tst"]
["SM Column","smpl_id","tst_meth","smpl_tst_nbr","lab_id","chrg_amt","strt_dt","est_cmpl_dt","actl_cmpl_dt","last_modfd_uid","last_modfd_dt"]
["Logical Validation","No duplicates of key (highlighted in yellow);\n\nIF Sample ID \"blank\", THEN skip to next record","Existing on t_tst_fee_schd",null,"Existing on t_qualf_lab"]
["Comment",null,null,null,"Lab ID",null,null,null,null,null,"Current system date"]
["Long Description","SiteManager \nSample ID ","Test Method","Test Number","SM Laboratory ID","Charge Amount","Received Date","Actual Start Date","Actual Completion Date","Last Modified User ID","Last Modified Date"]
["User Entry                                     XML Schema \nSheet Map                                   Column Name","smpl_id","tst_meth","smpl_tst_nbr","lab_id","chrg_amt","strt_dt","est_cmpl_dt","actl_cmpl_dt","last_modfd_uid","last_modfd_dt"]
[null,{"$f":"'Design Data'!C10","v":0},"AMMIXPACK",1,{"$f":"'Design Data'!H12","v":0},{"$f":"ROUND('Chart Data'!T15,2)","v":0},{"$f":"'Design Data'!H14","v":"00:00:00"},{"$f":"'Design Data'!H86","v":"00:00:00"},{"$f":"'Design Data'!H16","v":"00:00:00"},{"$f":"'Design Data'!S82","v":0}]

{"sheet":"t_smpl_tstr","index":22,"n_rows":8,"n_cols":7,"rows_kept":8,"cut":false,"hidden":true,"merged":[]}
["Special Processing",null,null,null,null,null,"d"]
["SM Table","t_smpl_tstr","t_smpl_tstr","t_smpl_tstr","t_smpl_tstr","t_smpl_tstr","t_smpl_tstr"]
["SM Column","smpl_id","tst_meth","smpl_tst_nbr","tst_id","last_modfd_uid","last_modfd_dt"]
["Logical Validation","No duplicates of key (highlighted in yellow);\n","Existing on t_tst_fee_schd",null,"Existing on t_matl_user \nAND  t_matl_user.tstr_ind='Y\"\nAND  active test qualification of \"Superpave Mix Design Tech.\" \n        (  I.e., At least one row returned from:\n         SELECT * FROM t_tst_prsnl_qualfn\n         WHERE tst_id = tst_id\n         AND      tst_prsnlqualfn_t = \"ASMD\"\n         AND      qualfn_lev_t = \"SMDT\"\n         AND      exp_dt >= t_smpl_tst.strt_dt (same keys as current row)\n         AND      effdt     <= t_smpl_tst.strt_dt (same keys as current row)\n\n         For any row above, return at least one row:\n         SELECT * FROM t_tst_prsnqualftst\n         WHERE tst_id = tst_id\n         AND      tst_prsnlqualfn_t = t_tst_prsnl_qualfn.tst_prsnlqualfn_t\n         AND      qualfn_lev_t = t_tst_prsnl_qualfn.qualfn_lev_t\n         AND      effdt = t_tst_prsnl_qualfn.effdt\n         AND      tst_meth = t_smpl_tst.tst_meth   )\n         "]
["Comment","IF No Sample ID, Ignore Row.",null,null,"The Approver must have active \"SUPERPAVE MIX DESIGN TECHNOLOGIST\" Sampler qualification (and therefore have a SM User ID) for a Material Category of \"ASPHALT-MIX DESIGN\".",null,"Current system date"]
["Long Description","SiteManager \nSample ID","Test Method","Test Number","Tester ID","Last Modified User ID","Last Modified Date"]
["User Entry                                     XML Schema \nSheet Map                                   Column Name","smpl_id","tst_meth","smpl_tst_nbr","tst_id","last_modfd_uid","last_modfd_dt"]
[null,{"$f":"'Design Data'!C10","v":0},"AMMIXPACK",1,{"$f":"'Design Data'!K16","v":0},{"$f":"'Design Data'!S82","v":0}]

{"sheet":"t_tst_rslt_hdr","index":23,"n_rows":8,"n_cols":8,"rows_kept":8,"cut":false,"hidden":true,"merged":[]}
["Special Processing",null,null,null,"c","c","d"]
["SM Table","t_tst_rslt_hdr","t_tst_rslt_hdr","t_tst_rslt_hdr","t_tst_rslt_hdr","t_tst_rslt_hdr","t_tst_rslt_hdr","t_tst_rslt_hdr"]
["SM Column","smpl_id","tst_meth","smpl_tst_nbr","rmrks_id","effdt","last_modfd_dt","last_modfd_uid"]
["Logical Validation","No duplicates of key (highlighted in yellow);\n\nIF Sample ID \"blank\", THEN skip to next record"]
["Comment","IF No Sample ID, Ignore Row.",null,null,"Not Used\nInitialized to \" \" (i.e., space)","Test Specification Date (Not used in this discipline)\nInitialized to 0","Current system date"]
["Long Description","Sample ID","Test Method","Test Number","Remarks ID","Effective Date","Last Modified Date","Last Modified User ID"]
["User Entry                                     XML Schema \nSheet Map                                   Column Name","smpl_id","tst_meth","smpl_tst_nbr","rmrks_id","effdt","last_modfd_dt","last_modfd_uid"]
[null,{"$f":"'Design Data'!C10","v":0},"AMMIXPACK",1," ",0,null,{"$f":"'Design Data'!S82","v":0}]

{"sheet":"t_tst_rslt_dtl","index":24,"n_rows":342,"n_cols":9,"rows_kept":342,"cut":false,"hidden":true,"merged":[]}
["Special Processing",null,null,null,null,null,null,null,"d"]
["SM Table","t_tst_rslt_dtl","t_tst_rslt_dtl","t_tst_rslt_dtl","t_tst_rslt_dtl","t_tst_rslt_dtl","t_tst_rslt_dtl","t_tst_rslt_dtl","t_tst_rslt_dtl"]
["SM Column","smpl_id","tst_meth","smpl_tst_nbr","tst_fld_sn","tst_strg_fld_val","tst_numrc_fld_val","last_modfd_uid","last_modfd_dt"]
["Logical Validation","No duplicates of key (highlighted in yellow);\n\nIF Sample ID \"blank\", THEN skip to next record",null,null,null,"Type & Size   AND\nCHOOSE CASE tst_fld_sn\n      CASE 2   [Code Table check]\n            Existing on t_cd_tbl_dtl (cd_id)\n            AND t_cd_tbl_dtl.tbl_id='TEMPSTAT'\n      ENDCASE","Type & Size (ALL ...fld_val FIELDS)  AND\n\nCHOOSE CASE tst_fld_sn  [SM \"Date\" Format]\n      CASE 137\n            Make sure to format MMDDYYYY\nENDCASE\n"]
["Comment",null,null,null,null,"IF Not Used,\nInitialize to \" \" \n(i.e., space)","IF Not Used\nInitialize to 0",null,"Current system date"]
["Long Description","Sample ID","Test Method","Test Number","Test Field Sequence Number","Test Field String Value","Test Field Numeric Value","Last Modified User ID","Last Modified Date"]
["User Entry                                     XML Schema \nSheet Map                                   Column Name","smpl_id","tst_meth","smpl_tst_nbr","tst_fld_sn","tst_strg_fld_val","tst_numrc_fld_val","last_modfd_uid","last_modfd_dt"]
["Comment  (NOT CURRENTLY USED)",{"$f":"'Design Data'!C10","v":0},"AMMIXPACK",1,1," ",0,{"$f":"'Design Data'!S82","v":0}]
["Template Status (TEMPSTAT)",{"$f":"B8","v":0},{"$f":"C8","v":"AMMIXPACK"},1,2,{"$f":"IF(B9=\"\",\" \",IF(t_smpl!Z8=\"COMP\",\"ISPC\",\"OSPC\"))","v":"ISPC"},0,{"$f":"H8","v":0}]
["GenericString2  (NOT CURRENTLY USED)",0,"AMMIXPACK",1,3," ",0,0]
["GenericNum1  (NOT CURRENTLY USED)",0,"AMMIXPACK",1,4," ",0,0]
["GenericNum2  (NOT CURRENTLY USED)",0,"AMMIXPACK",1,5," ",0,0]
["GenericNum3  (NOT CURRENTLY USED)",0,"AMMIXPACK",1,6," ",0,0]
["GenericNum4  (NOT CURRENTLY USED)",0,"AMMIXPACK",{"$f":"D13","v":1},7," ",0,0]
["LABEL: PROJECT INFORMATION",0,"AMMIXPACK",1,8," ",0,0]
["RAP Note",0,"AMMIXPACK",1,9,{"$f":"'Design Data'!A19","v":"(as specified in Bid Item)"},0,0]
["SUBMITTAL TYPE:",0,"AMMIXPACK",1,10,{"$f":"'Chart Data'!J7","v":""},0,0]
["COUNTY:",0,"AMMIXPACK",1,11,{"$f":"'Design Data'!K10","v":0},0,0]
["TOTAL TONS:",0,"AMMIXPACK",1,12," ",{"$f":"IF('Design Data'!Q12=\"\",0,ROUND('Design Data'!Q12,0))","v":0},0]
["DEPTH (mm):",0,"AMMIXPACK",1,13," ",{"$f":"IF('Design Data'!K20=\"\",\"\",ROUND('Design Data'!K20,0))","v":""},0]
["BINDER GRADE",0,"AMMIXPACK",1,14,{"$f":"'Design Data'!C18","v":""},0,0]
["LABEL: 4-PT. GYRATORY MIX DESIGN INFORMATION",0,"AMMIXPACK",1,15," ",0,0]
["AC           ",0,"AMMIXPACK",1,16," ",{"$f":"IF('Design Data'!A86=\"\",0,ROUND('Design Data'!A86,1))","v":0},0]
["Gmmini  ",0,"AMMIXPACK",1,17," ",{"$f":"IF('Design Data'!B86=\"\",0,ROUND('Design Data'!B86,1))","v":0},0]
["AV            ",{"$f":"B24","v":0},"AMMIXPACK",1,18," ",{"$f":"IF('Design Data'!D86=\"\",0,ROUND('Design Data'!D86,1))","v":0},0]
["VMA       ",0,"AMMIXPACK",1,19," ",{"$f":"IF('Design Data'!F86=\"\",0,ROUND('Design Data'!F86,1))","v":0},0]
["VFA         ",0,"AMMIXPACK",1,20," ",{"$f":"IF('Design Data'!B91=\"\",0,ROUND('Design Data'!B91,1))","v":0},0]
["UW           ",0,"AMMIXPACK",1,21," ",{"$f":"IF('Design Data'!D91=\"\",0,ROUND('Design Data'!D91,1))","v":0},0]
["MSG       ",0,"AMMIXPACK",1,22," ",{"$f":"IF('Design Data'!F91=\"\",0,ROUND('Design Data'!F91,3))","v":0},0]
["Eff. AC   ",0,"AMMIXPACK",1,23," ",{"$f":"IF('Design Data'!B96=\"\",0,ROUND('Design Data'!B96,1))","v":0},0]
["Film Th  ",0,"AMMIXPACK",1,24," ",{"$f":"IF('Design Data'!D96=\"\",0,ROUND('Design Data'!D96,1))","v":0},0]
["D/A         ",0,"AMMIXPACK",1,25," ",{"$f":"IF('Design Data'!F96=\"\",0,ROUND('Design Data'!F96,1))","v":0},0]
["Point 2 - AC           ",0,"AMMIXPACK",1,26," ",{"$f":"IF('Design Data'!A87=\"\",0,ROUND('Design Data'!A87,1))","v":0},0]
["Point 2 - Gmmini  ",0,"AMMIXPACK",1,27," ",{"$f":"IF('Design Data'!B87=\"\",0,ROUND('Design Data'!B87,1))","v":0},0]
["Point 2 - AV            ",0,"AMMIXPACK",1,28," ",{"$f":"IF('Design Data'!D87=\"\",0,ROUND('Design Data'!D87,1))","v":0},0]
["Point 2 - VMA       ",0,"AMMIXPACK",1,29," ",{"$f":"IF('Design Data'!F87=\"\",0,ROUND('Design Data'!F87,1))","v":0},0]
["Point 2 - VFA         ",0,"AMMIXPACK",1,30," ",{"$f":"IF('Design Data'!B92=\"\",0,ROUND('Design Data'!B92,1))","v":0},0]
["Point 2 - UW           ",0,"AMMIXPACK",1,31," ",{"$f":"IF('Design Data'!D92=\"\",0,ROUND('Design Data'!D92,1))","v":0},0]
["Point 2 - MSG       ",0,"AMMIXPACK",1,32," ",{"$f":"IF('Design Data'!F92=\"\",0,ROUND('Design Data'!F92,3))","v":0},0]
["Point 2 - Eff. AC   ",0,"AMMIXPACK",1,33," ",{"$f":"IF('Design Data'!B97=\"\",0,ROUND('Design Data'!B97,1))","v":0},0]
["Point 2 - Film Th  ",{"$f":"B40","v":0},"AMMIXPACK",1,34," ",{"$f":"IF('Design Data'!D97=\"\",0,ROUND('Design Data'!D97,1))","v":0},0]
["Point 2 - D/A         ",0,"AMMIXPACK",1,35," ",{"$f":"IF('Design Data'!F97=\"\",0,ROUND('Design Data'!F97,1))","v":0},0]
["Point 3 - AC           ",0,"AMMIXPACK",1,36," ",{"$f":"IF('Design Data'!A88=\"\",0,ROUND('Design Data'!A88,1))","v":0},0]
["Point 3 - Gmmini  ",0,"AMMIXPACK",1,37," ",{"$f":"IF('Design Data'!B88=\"\",0,ROUND('Design Data'!B88,1))","v":0},0]
["Point 3 - AV            ",0,"AMMIXPACK",1,38," ",{"$f":"IF('Design Data'!D88=\"\",0,ROUND('Design Data'!D88,1))","v":0},0]
["Point 3 - VMA       ",0,"AMMIXPACK",1,39," ",{"$f":"IF('Design Data'!F88=\"\",0,ROUND('Design Data'!F88,1))","v":0},0]
["Point 3 - VFA         ",0,"AMMIXPACK",1,40," ",{"$f":"IF('Design Data'!B93=\"\",0,ROUND('Design Data'!B93,1))","v":0},0]
["Point 3 - UW           ",0,"AMMIXPACK",1,41," ",{"$f":"IF('Design Data'!D93=\"\",0,ROUND('Design Data'!D93,1))","v":0},0]
["Point 3 - MSG       ",0,"AMMIXPACK",1,42," ",{"$f":"IF('Design Data'!F93=\"\",0,ROUND('Design Data'!F93,3))","v":0},0]
["Point 3 - Eff. AC   ",0,"AMMIXPACK",1,43," ",{"$f":"IF('Design Data'!B98=\"\",0,ROUND('Design Data'!B98,1))","v":0},0]
["Point 3 - Film Th  ",0,"AMMIXPACK",1,44," ",{"$f":"IF('Design Data'!D98=\"\",0,ROUND('Design Data'!D98,1))","v":0},0]
["Point 3 - D/A         ",0,"AMMIXPACK",1,45," ",{"$f":"IF('Design Data'!F98=\"\",0,ROUND('Design Data'!F98,1))","v":0},0]
["Point 4 - AC           ",0,"AMMIXPACK",1,46," ",{"$f":"IF('Design Data'!A89=\"\",0,ROUND('Design Data'!A89,1))","v":0},0]
["Point 4 - Gmmini  ",0,"AMMIXPACK",1,47," ",{"$f":"IF('Design Data'!B89=\"\",0,ROUND('Design Data'!B89,1))","v":0},0]
["Point 4 - AV            ",0,"AMMIXPACK",1,48," ",{"$f":"IF('Design Data'!D89=\"\",0,ROUND('Design Data'!D89,1))","v":0},0]
["Point 4 - VMA       ",0,"AMMIXPACK",1,49," ",{"$f":"IF('Design Data'!F89=\"\",0,ROUND('Design Data'!F89,1))","v":0},0]
["Point 4 - VFA         ",{"$f":"B56","v":0},"AMMIXPACK",1,50," ",{"$f":"IF('Design Data'!B94=\"\",0,ROUND('Design Data'!B94,1))","v":0},0]
["Point 4 - UW           ",0,"AMMIXPACK",1,51," ",{"$f":"IF('Design Data'!D94=\"\",0,ROUND('Design Data'!D94,1))","v":0},0]
["Point 4 - MSG       ",0,"AMMIXPACK",1,52," ",{"$f":"IF('Design Data'!F94=\"\",0,ROUND('Design Data'!F94,3))","v":0},0]
["Point 4 - Eff. AC   ",0,"AMMIXPACK",1,53," ",{"$f":"IF('Design Data'!B99=\"\",0,ROUND('Design Data'!B99,1))","v":0},0]
["Point 4 - Film Th  ",0,"AMMIXPACK",1,54," ",{"$f":"IF('Design Data'!D99=\"\",0,ROUND('Design Data'!D99,1))","v":0},0]
["Point 4 - D/A         ",0,"AMMIXPACK",1,55," ",{"$f":"IF('Design Data'!F99=\"\",0,ROUND('Design Data'!F99,1))","v":0},0]
["LABEL: Template Name:  AMMIXPACK",0,"AMMIXPACK",1,56," ",0,0]
["LABEL: Descrip.:  MIX DESIGN SPREADSHEET",0,"AMMIXPACK",1,57," ",0,0]
["LABEL: GRADATION INFORMATION",0,"AMMIXPACK",1,58," ",0,0]
["LABEL: Sieve",0,"AMMIXPACK",1,59," ",0,0]
["LABEL: JMF",0,"AMMIXPACK",1,60," ",0,0]
["2 \"         ",0,"AMMIXPACK",1,61," ",{"$f":"IF('Design Data'!T61=\"\",0,ROUND('Design Data'!T61,0))","v":100},0]
["1 1/2 \"   ",0,"AMMIXPACK",1,62," ",{"$f":"IF('Design Data'!T62=\"\",0,ROUND('Design Data'!T62,0))","v":0},0]
["1 \"          ",0,"AMMIXPACK",1,63," ",{"$f":"IF('Design Data'!T63=\"\",0,ROUND('Design Data'!T63,0))","v":0},0]
["3/4 \"     ",0,"AMMIXPACK",1,64," ",{"$f":"IF('Design Data'!T64=\"\",0,ROUND('Design Data'!T64,0))","v":0},0]
["1/2 \"      ",0,"AMMIXPACK",1,65," ",{"$f":"IF('Design Data'!T65=\"\",0,ROUND('Design Data'!T65,0))","v":0},0]
["3/8 \"     ",{"$f":"B72","v":0},"AMMIXPACK",1,66," ",{"$f":"IF('Design Data'!T66=\"\",0,ROUND('Design Data'!T66,0))","v":0},{"$f":"H72","v":0}]
["1/4 \"      ",0,"AMMIXPACK",1,67," ",{"$f":"IF('Design Data'!T67=\"N / A\",0,IF('Design Data'!T67=\"\",0,ROUND('Design Data'!T67,0)))","v":0},0]
["#4         ",0,"AMMIXPACK",1,68," ",{"$f":"IF('Design Data'!T68=\"\",0,ROUND('Design Data'!T68,0))","v":0},0]
["#8         ",0,"AMMIXPACK",1,69," ",{"$f":"IF('Design Data'!T69=\"\",0,ROUND('Design Data'!T69,0))","v":0},0]
["#16        ",0,"AMMIXPACK",1,70," ",{"$f":"IF('Design Data'!T70=\"\",0,ROUND('Design Data'!T70,0))","v":0},0]
["#30       ",0,"AMMIXPACK",1,71," ",{"$f":"IF('Design Data'!T71=\"\",0,ROUND('Design Data'!T71,0))","v":0},0]
["#50       ",0,"AMMIXPACK",1,72," ",{"$f":"IF('Design Data'!T72=\"\",0,ROUND('Design Data'!T72,0))","v":0},0]
["#100      ",0,"AMMIXPACK",1,73," ",{"$f":"IF('Design Data'!T73=\"\",0,ROUND('Design Data'!T73,0))","v":0},0]
["#200     ",0,"AMMIXPACK",1,74," ",{"$f":"IF('Design Data'!T74=\"\",0,ROUND('Design Data'!T74,1))","v":0},0]
["LABEL: '\"WeighUp\"",0,"AMMIXPACK",1,75," ",0,0]
["WeighUp - 2 \"         ",0,"AMMIXPACK",1,76," ",{"$f":"IF('Design Data'!U15=\"\",0,ROUND('Design Data'!U15,0))","v":100},0]
["WeighUp - 1 1/2 \"   ",0,"AMMIXPACK",1,77," ",{"$f":"IF('Design Data'!U16=\"\",0,ROUND('Design Data'!U16,0))","v":0},0]
["WeighUp - 1 \"          ",0,"AMMIXPACK",1,78," ",{"$f":"IF('Design Data'!U17=\"\",0,ROUND('Design Data'!U17,0))","v":0},0]
["WeighUp - 3/4 \"     ",0,"AMMIXPACK",1,79," ",{"$f":"IF('Design Data'!U18=\"\",0,ROUND('Design Data'!U18,0))","v":0},0]
["WeighUp - 1/2 \"      ",0,"AMMIXPACK",1,80," ",{"$f":"IF('Design Data'!U19=\"\",0,ROUND('Design Data'!U19,0))","v":0},0]
["WeighUp - 3/8 \"     ",0,"AMMIXPACK",1,81," ",{"$f":"IF('Design Data'!U20=\"\",0,ROUND('Design Data'!U20,0))","v":0},0]
["WeighUp - 1/4 \"      ",{"$f":"B88","v":0},"AMMIXPACK",1,82," ",{"$f":"IF('Design Data'!U21=\"N /A\",0,IF('Design Data'!U21=\"\",0,ROUND('Design Data'!U21,0)))","v":{"$error":"#VALUE!"}},0]
["WeighUp - #4         ",0,"AMMIXPACK",1,83," ",{"$f":"IF('Design Data'!U22=\"\",0,ROUND('Design Data'!U22,0))","v":0},0]
["WeighUp - #8         ",0,"AMMIXPACK",1,84," ",{"$f":"IF('Design Data'!U23=\"\",0,ROUND('Design Data'!U23,0))","v":0},0]
["WeighUp - #16        ",0,"AMMIXPACK",1,85," ",{"$f":"IF('Design Data'!U24=\"\",0,ROUND('Design Data'!U24,0))","v":0},0]
["WeighUp - #30       ",0,"AMMIXPACK",1,86," ",{"$f":"IF('Design Data'!U25=\"\",0,ROUND('Design Data'!U25,0))","v":0},0]
["WeighUp - #50       ",0,"AMMIXPACK",1,87," ",{"$f":"IF('Design Data'!U26=\"\",0,ROUND('Design Data'!U26,0))","v":0},0]
["WeighUp - #100      ",0,"AMMIXPACK",1,88," ",{"$f":"IF('Design Data'!U27=\"\",0,ROUND('Design Data'!U27,0))","v":0},0]
["WeighUp - #200     ",0,"AMMIXPACK",1,89," ",{"$f":"IF('Design Data'!U28=\"\",0,ROUND('Design Data'!U28,1))","v":0},0]
["LABEL: MIXTURE DESIGN APPROVAL INFORMATION",0,"AMMIXPACK",1,90," ",0,0]
["LABEL: Design Property",0,"AMMIXPACK",1,91," ",0,0]
["Notes",0,"AMMIXPACK",1,92,{"$f":"IF('Design Data'!M76=\"\",\"\",'Design Data'!M76)","v":""},0,0]
["LABEL: Design Value",0,"AMMIXPACK",1,93," ",0,0]
["Coarse Aggregate Angularity (%)",0,"AMMIXPACK",1,94,{"$f":"'Design Data'!O52","v":0},0,0]
["Fine Aggregate Angularity (%)",0,"AMMIXPACK",1,95," ",{"$f":"IF('Design Data'!O53=\"\",0,ROUND('Design Data'!O53,0))","v":0},0]
["Flat & Elongated Particles (%)",0,"AMMIXPACK",1,96," ",{"$f":"IF('Design Data'!O54=\"\",0,ROUND('Design Data'!O54,0))","v":0},0]
["Clay Content (SE) (%)",0,"AMMIXPACK",1,97," ",{"$f":"IF('Design Data'!O55=\"\",0,ROUND('Design Data'!O55,0))","v":0},0]
["% VFA",{"$f":"B104","v":0},"AMMIXPACK",1,98," ",{"$f":"IF('Design Data'!O56=\"\",0,ROUND('Design Data'!O56,1))","v":0},0]
["% VMA",0,"AMMIXPACK",1,99," ",{"$f":"IF('Design Data'!O57=\"\",0,ROUND('Design Data'!O57,1))","v":0},0]
["D/A Ratio",0,"AMMIXPACK",1,100," ",{"$f":"IF('Design Data'!O58=\"\",0,ROUND('Design Data'!O58,1))","v":0},0]
["% Gmm @ Ninitial",0,"AMMIXPACK",1,101," ",{"$f":"IF('Design Data'!O59=\"\",0,ROUND('Design Data'!O59,1))","v":0},0]
["% Gmm @ Nmax",0,"AMMIXPACK",1,102," ",{"$f":"IF('Design Data'!O60=\"\",0,ROUND('Design Data'!O60,1))","v":0},0]
["% Air Voids",0,"AMMIXPACK",1,103," ",{"$f":"IF('Design Data'!O61=\"\",0,ROUND('Design Data'!O61,1))","v":0},0]
["Unit Weight (lb/ft3)",0,"AMMIXPACK",1,104," ",{"$f":"IF('Design Data'!O62=\"\",0,ROUND('Design Data'!O62,1))","v":0},0]
["% AC",0,"AMMIXPACK",1,105," ",{"$f":"IF('Design Data'!O63=\"\",0,ROUND('Design Data'!O63,1))","v":0},0]
["% Effective AC",0,"AMMIXPACK",1,106," ",{"$f":"IF('Design Data'!O64=\"\",0,ROUND('Design Data'!O64,1))","v":0},0]
["Maximum Specific Gravity",0,"AMMIXPACK",1,107," ",{"$f":"IF('Design Data'!O65=\"\",0,ROUND('Design Data'!O65,3))","v":0},0]
["% Absorbed AC (Mix)",0,"AMMIXPACK",1,108," ",{"$f":"IF('Design Data'!O66=\"\",0,ROUND('Design Data'!O66,2))","v":0},0]
["Gsb",0,"AMMIXPACK",1,109," ",{"$f":"IF('Design Data'!O67=\"\",0,ROUND('Design Data'!O67,2))","v":0},0]
["Gse",0,"AMMIXPACK",1,110," ",{"$f":"IF('Design Data'!O68=\"\",0,ROUND('Design Data'!O68,3))","v":0},0]
["Film Thickness (µm)",0,"AMMIXPACK",1,111," ",{"$f":"IF('Design Data'!O69=\"\",0,ROUND('Design Data'!O69,1))","v":0},0]
["Specimen Weight (g)",0,"AMMIXPACK",1,112," ",{"$f":"IF('Design Data'!O70=\"\",0,ROUND('Design Data'!O70,0))","v":0},0]
["TSR Weight (g)",0,"AMMIXPACK",1,113," ",{"$f":"IF('Design Data'!O71=\"\",0,ROUND('Design Data'!O71,0))","v":0},0]
["% TSR without additive",{"$f":"B120","v":0},"AMMIXPACK",1,114," ",{"$f":"IF('Design Data'!O72=\"\",0,ROUND('Design Data'!O72,0))","v":0},0]
["% TSR with additive",0,"AMMIXPACK",1,115," ",{"$f":"IF('Design Data'!O73=\"\",0,ROUND('Design Data'!O73,0))","v":0},0]
["% Additive",0,"AMMIXPACK",1,116," ",{"$f":"IF('Design Data'!O74=\"\",0,ROUND('Design Data'!O74,2))","v":0},0]
["Type of Additive",0,"AMMIXPACK",1,117,{"$f":"'Design Data'!O75","v":""},0,0]
["LABEL: Criteria",0,"AMMIXPACK",1,118," ",0,0]
["Criteria - Coarse Aggregate Angularity (%)",0,"AMMIXPACK",1,119,{"$f":"'Design Data'!P52","v":""},0,0]
["Criteria - Fine Aggregate Angularity (%)",0,"AMMIXPACK",1,120,{"$f":"'Design Data'!P53","v":""},0,0]
["Criteria - Flat & Elongated Particles (%)",0,"AMMIXPACK",1,121,{"$f":"'Design Data'!P54","v":""},0,0]
["Criteria - Clay Content (SE) (%)",0,"AMMIXPACK",1,122,{"$f":"'Design Data'!P55","v":""},0,0]
["Criteria - % VFA",0,"AMMIXPACK",1,123,{"$f":"'Design Data'!P56","v":""},0,0]
["Criteria - % VMA",0,"AMMIXPACK",1,124,{"$f":"'Design Data'!P57","v":""},0,0]
["Criteria - D/A Ratio",0,"AMMIXPACK",1,125,{"$f":"'Design Data'!P58","v":""},0,0]
["Criteria - % Gmm @ Ninitial",0,"AMMIXPACK",1,126,{"$f":"'Design Data'!P59","v":""},0,0]
["Criteria - % Gmm @ Nmax",0,"AMMIXPACK",1,127,{"$f":"'Design Data'!P60","v":""},0,0]
["Criteria - % Air Voids",0,"AMMIXPACK",1,128,{"$f":"'Design Data'!P61","v":""},0,0]
["Criteria - % AC",0,"AMMIXPACK",1,129,{"$f":"'Design Data'!P63","v":""},0,0]
["Criteria - % TSR without additive",{"$f":"B136","v":0},"AMMIXPACK",1,130,{"$f":"'Design Data'!P72","v":""},0,{"$f":"H136","v":0}]
["Criteria - % TSR with additive",0,"AMMIXPACK",1,131,{"$f":"'Design Data'!P73","v":""},0,0]
["LABEL: Reference Information",0,"AMMIXPACK",1,132," ",0,0]
["Additional Reference Information",0,"AMMIXPACK",1,133,{"$f":"'Design Data'!S58","v":""},0,0]
["COUNTY:",0,"AMMIXPACK",1,134,{"$f":"'Design Data'!T52","v":""},0,0]
["ID#:",0,"AMMIXPACK",1,135,{"$f":"'Design Data'!T53","v":""},0,0]
["Binder:",0,"AMMIXPACK",1,136,{"$f":"'Design Data'!T54","v":""},0,0]
["Date Released:",0,"AMMIXPACK",1,137," ",{"$f":"IF('Design Data'!U55=\"\",0,IF('Design Data'!U55=\"N/A\",0,'Design Data'!U55))","v":"00:00:00"},0]
["Design AC%:",0,"AMMIXPACK",1,138,{"$f":"'Design Data'!U56","v":""},0,0]
["Job Complete?",0,"AMMIXPACK",1,139,{"$f":"'Design Data'!U57","v":""},0,0]
["LABEL: RAP Information",0,"AMMIXPACK",1,140," ",0,0]
["% AC in RAP:",0,"AMMIXPACK",1,141,null,{"$f":"IF('Design Data'!U77=\"\",0,ROUND('Design Data'!U77,1))","v":0},0]
["% Virgin AC in mix:",0,"AMMIXPACK",1,142,null,{"$f":"IF('Design Data'!U78=\"\",0,ROUND('Design Data'!U78,1))","v":0},0]
["% RAP AC in mix:",0,"AMMIXPACK",1,143,null,{"$f":"IF('Design Data'!U79=\"\",0,ROUND('Design Data'!U79,1))","v":0},0]
["Total % AC in mix:",0,"AMMIXPACK",1,144,null,{"$f":"IF('Design Data'!U80=\"\",0,ROUND('Design Data'!U80,1))","v":0},0]
["RAP MSG's",0,"AMMIXPACK",1,145,{"$f":"IF('Design Data'!N27=\"\",\"\",'Design Data'!N27)","v":""},0,0]
["RAP MSG: \"label\" assignment",{"$f":"B151","v":0},"AMMIXPACK",1,254,{"$f":"IF('Design Data'!N28=\"\",\"\",'Design Data'!N28)","v":""},0,{"$f":"H151","v":0}]
["RAP MSG's (2)",0,"AMMIXPACK",1,146,{"$f":"IF('Design Data'!O27=\"\",\"\",'Design Data'!O27)","v":""},0,{"$f":"H152","v":0}]
["'RAP Gsb =",{"$f":"B154","v":0},"AMMIXPACK",1,147,null,{"$f":"IF('Design Data'!O28=\"\",0,ROUND('Design Data'!O28,2))","v":0},0]
["LABEL: APPROVAL INFORMATION",0,"AMMIXPACK",1,148," ",0,0]
["Complete SGC Des.",0,"AMMIXPACK",1,149,{"$f":"IF('Design Data'!N79=\"\",\"\",'Design Data'!N79)","v":""},0,0]
["App.-New Design",0,"AMMIXPACK",1,150,{"$f":"IF('Design Data'!N80=\"\",\"\",'Design Data'!N80)","v":""},0,0]
["MCL Design",0,"AMMIXPACK",1,151,{"$f":"IF('Design Data'!N81=\"\",\"\",'Design Data'!N81)","v":""},0,0]
["1-Pt. SGC Des.",0,"AMMIXPACK",1,152,{"$f":"IF('Design Data'!Q79=\"\",\"\",'Design Data'!Q79)","v":""},0,0]
["App.-Ref. Mix",0,"AMMIXPACK",1,153,{"$f":"IF('Design Data'!Q80=\"\",\"\",'Design Data'!Q80)","v":""},0,0]
["Contr. Design",0,"AMMIXPACK",1,154,{"$f":"IF('Design Data'!Q81=\"\",\"\",'Design Data'!Q81)","v":""},0,0]
["Revised Asphalt Content (+ or - 0.3%):",0,"AMMIXPACK",1,155,{"$f":"IF('Design Data'!Q82=\"\",\"\",'Design Data'!Q82)","v":""},0,0]
["LABEL: TSR INFORMATION",0,"AMMIXPACK",1,156," ",0,0]
["%AC:",0,"AMMIXPACK",1,157,null,{"$f":"IF(TSR!G18=\"\",0,ROUND(TSR!G18,1))","v":0},0]
["% ADDITIVE:",0,"AMMIXPACK",1,158,{"$f":"IF(TSR!H18=\"\",\"\",TSR!H18)","v":""},0,0]
["TYPE OF ADDITIVE:",0,"AMMIXPACK",1,159,{"$f":"IF(TSR!G20=\"\",\"\",TSR!G20)","v":""},0,0]
["% Air Voids w/o add.",0,"AMMIXPACK",1,160,null,{"$f":"IF(TSR!H39=\"\",0,ROUND(TSR!H39,1))","v":0},0]
["% Initial Saturation w/o Add.",0,"AMMIXPACK",1,161,null,{"$f":"IF(TSR!H46=\"\",0,ROUND(TSR!H46,1))","v":0},0]
["% Final Saturation w/o Add.",0,"AMMIXPACK",1,162,null,{"$f":"IF(TSR!H52=\"\",0,ROUND(TSR!H52,1))","v":0},0]
["Wet Strength w/o add. (psi)",{"$f":"B170","v":0},"AMMIXPACK",1,163,null,{"$f":"IF(TSR!H54=\"\",0,ROUND(TSR!H54,1))","v":0},0]
["Dry Strength w/o add. (psi)",0,"AMMIXPACK",1,164,null,{"$f":"IF(TSR!H55=\"\",0,ROUND(TSR!H55,1))","v":0},0]
["% TSR w/o Add. = ",0,"AMMIXPACK",1,165,null,{"$f":"IF(TSR!G57=\"\",0,ROUND(TSR!G57,0))","v":0},0]
["% Air Voids with add.",0,"AMMIXPACK",1,166,null,{"$f":"IF(TSR!O39=\"\",0,ROUND(TSR!O39,1))","v":0},0]
["% Initial Saturation with Add.",0,"AMMIXPACK",1,167,null,{"$f":"IF(TSR!O46=\"\",0,ROUND(TSR!O46,1))","v":0},0]
["% Final Saturation with Add.",0,"AMMIXPACK",1,168,null,{"$f":"IF(TSR!O52=\"\",0,ROUND(TSR!O52,1))","v":0},0]
["Wet Strength with add. (psi)",0,"AMMIXPACK",1,169,null,{"$f":"IF(TSR!O54=\"\",0,ROUND(TSR!O54,1))","v":0},0]
["Dry Strength with add. (psi)",0,"AMMIXPACK",1,170,null,{"$f":"IF(TSR!O55=\"\",0,ROUND(TSR!O55,1))","v":0},0]
["% TSR with Add. = ",0,"AMMIXPACK",1,171,null,{"$f":"IF(TSR!N57=\"\",0,ROUND(TSR!N57,0))","v":0},0]
["LABEL: MIX DESIGN AGGREGATE INFORMATION",0,"AMMIXPACK",1,172," ",0,0]
["AGG. PROD. NO.",0,"AMMIXPACK",1,173,{"$f":"IF('Design Data'!A23=\"\",\"\",'Design Data'!A23)","v":""},0,0]
["AGG. PROD. NO. #2",0,"AMMIXPACK",1,174,{"$f":"IF('Design Data'!A24=\"\",\"\",'Design Data'!A24)","v":""},0,0]
["AGG. PROD. NO. #3",0,"AMMIXPACK",1,175,{"$f":"IF('Design Data'!A25=\"\",\"\",'Design Data'!A25)","v":""},0,0]
["AGG. PROD. NO. #4",0,"AMMIXPACK",1,176,{"$f":"IF('Design Data'!A26=\"\",\"\",'Design Data'!A26)","v":""},0,0]
["AGG. PROD. NO. #5",0,"AMMIXPACK",1,177,{"$f":"IF('Design Data'!A27=\"\",\"\",'Design Data'!A27)","v":""},0,0]
["AGG. PROD. NO. #6",0,"AMMIXPACK",1,178,{"$f":"IF('Design Data'!A28=\"\",\"\",'Design Data'!A28)","v":""},0,0]
["PRODUCER NAME",{"$f":"B186","v":0},"AMMIXPACK",1,179,{"$f":"IF('Design Data'!C23=\"\",\"\",'Design Data'!C23)","v":""},0,0]
["PRODUCER NAME #2",0,"AMMIXPACK",1,180,{"$f":"IF('Design Data'!C24=\"\",\"\",'Design Data'!C24)","v":""},0,0]
["PRODUCER NAME #3",0,"AMMIXPACK",1,181,{"$f":"IF('Design Data'!C25=\"\",\"\",'Design Data'!C25)","v":""},0,0]
["PRODUCER NAME #4",0,"AMMIXPACK",1,182,{"$f":"IF('Design Data'!C26=\"\",\"\",'Design Data'!C26)","v":""},0,0]
["PRODUCER NAME #5",0,"AMMIXPACK",1,183,{"$f":"IF('Design Data'!C27=\"\",\"\",'Design Data'!C27)","v":""},0,0]
["PRODUCER NAME #6",0,"AMMIXPACK",1,184,{"$f":"IF('Design Data'!C28=\"\",\"\",'Design Data'!C28)","v":""},0,0]
["MAT.CODE",0,"AMMIXPACK",1,185,{"$f":"IF('Design Data'!H23=\"\",\"\",'Design Data'!H23)","v":""},0,0]
["MAT.CODE #2",0,"AMMIXPACK",1,186,{"$f":"IF('Design Data'!H24=\"\",\"\",'Design Data'!H24)","v":""},0,0]
["MAT.CODE #3",0,"AMMIXPACK",1,187,{"$f":"IF('Design Data'!H25=\"\",\"\",'Design Data'!H25)","v":""},0,0]
["MAT.CODE #4",0,"AMMIXPACK",1,188,{"$f":"IF('Design Data'!H26=\"\",\"\",'Design Data'!H26)","v":""},0,0]
["MAT.CODE #5",0,"AMMIXPACK",1,189,{"$f":"IF('Design Data'!H27=\"\",\"\",'Design Data'!H27)","v":""},0,0]
["MAT.CODE #6",0,"AMMIXPACK",1,190,{"$f":"IF('Design Data'!H28=\"\",\"\",'Design Data'!H28)","v":""},0,0]
["AGG. TYPE",0,"AMMIXPACK",1,191,{"$f":"IF('Design Data'!J23=\"\",\"\",'Design Data'!J23)","v":""},0,0]
["AGG. TYPE #2",0,"AMMIXPACK",1,192,{"$f":"IF('Design Data'!J24=\"\",\"\",'Design Data'!J24)","v":""},0,0]
["AGG. TYPE #3",0,"AMMIXPACK",1,193,{"$f":"IF('Design Data'!J25=\"\",\"\",'Design Data'!J25)","v":""},0,{"$f":"H200","v":0}]
["AGG. TYPE #4",0,"AMMIXPACK",1,194,{"$f":"IF('Design Data'!J26=\"\",\"\",'Design Data'!J26)","v":""},0,0]
["AGG. TYPE #5",{"$f":"B202","v":0},"AMMIXPACK",1,195,{"$f":"IF('Design Data'!J27=\"\",\"\",'Design Data'!J27)","v":""},0,0]
["AGG. TYPE #6",0,"AMMIXPACK",1,196,{"$f":"IF('Design Data'!J28=\"\",\"\",'Design Data'!J28)","v":""},0,0]
["Gsb",0,"AMMIXPACK",1,197,null,{"$f":"IF('Design Data'!L23=\"\",0,ROUND('Design Data'!L23,2))","v":0},0]
["Gsb #2",0,"AMMIXPACK",1,198,null,{"$f":"IF('Design Data'!L24=\"\",0,ROUND('Design Data'!L24,2))","v":0},0]
["Gsb #3",0,"AMMIXPACK",1,199,null,{"$f":"IF('Design Data'!L25=\"\",0,ROUND('Design Data'!L25,2))","v":0},0]
["Gsb #4",0,"AMMIXPACK",1,200,null,{"$f":"IF('Design Data'!L26=\"\",0,ROUND('Design Data'!L26,2))","v":0},0]
["Gsb #5",0,"AMMIXPACK",1,201,null,{"$f":"IF('Design Data'!L27=\"\",0,ROUND('Design Data'!L27,2))","v":0},0]
["Gsb #6",0,"AMMIXPACK",1,202,null,{"$f":"IF('Design Data'!L28=\"\",0,ROUND('Design Data'!L28,2))","v":0},0]
["%",0,"AMMIXPACK",1,203,null,{"$f":"IF('Design Data'!M23=\"\",0,ROUND('Design Data'!M23,0))","v":0},0]
["% #2",0,"AMMIXPACK",1,204,null,{"$f":"IF('Design Data'!M24=\"\",0,ROUND('Design Data'!M24,0))","v":0},0]
["% #3",0,"AMMIXPACK",1,205,null,{"$f":"IF('Design Data'!M25=\"\",0,ROUND('Design Data'!M25,0))","v":0},0]
["% #4",0,"AMMIXPACK",1,206,null,{"$f":"IF('Design Data'!M26=\"\",0,ROUND('Design Data'!M26,0))","v":0},0]
["% #5",0,"AMMIXPACK",1,207,null,{"$f":"IF('Design Data'!M27=\"\",0,ROUND('Design Data'!M27,0))","v":0},0]
["% #6",0,"AMMIXPACK",1,208,null,{"$f":"IF('Design Data'!M28=\"\",0,ROUND('Design Data'!M28,0))","v":0},0]
["S/C",0,"AMMIXPACK",1,209,{"$f":"IF('Design Data'!M113=\"\",\"\",'Design Data'!M113)","v":""},0,0]
["AGG S/C #2",0,"AMMIXPACK",1,210,{"$f":"IF('Design Data'!M114=\"\",\"\",'Design Data'!M114)","v":""},0,0]
["AGG S/C #3",{"$f":"B218","v":0},"AMMIXPACK",1,211,{"$f":"IF('Design Data'!M115=\"\",\"\",'Design Data'!M115)","v":""},0,0]
["AGG S/C #4",0,"AMMIXPACK",1,212,{"$f":"IF('Design Data'!M116=\"\",\"\",'Design Data'!M116)","v":""},0,0]
["AGG S/C #5",0,"AMMIXPACK",1,213,{"$f":"IF('Design Data'!M117=\"\",\"\",'Design Data'!M117)","v":""},0,0]
["AGG S/C #6",0,"AMMIXPACK",1,214,{"$f":"IF('Design Data'!M118=\"\",\"\",'Design Data'!M118)","v":""},0,0]
["SiteManager Agg. Sample ID #",0,"AMMIXPACK",1,215,{"$f":"IF('Design Data'!N113=\"\",\"\",'Design Data'!N113)","v":""},0,0]
["SiteManager Agg. Sample ID #2",0,"AMMIXPACK",1,216,{"$f":"IF('Design Data'!N114=\"\",\"\",'Design Data'!N114)","v":""},0,0]
["SiteManager Agg. Sample ID #3",0,"AMMIXPACK",1,217,{"$f":"IF('Design Data'!N115=\"\",\"\",'Design Data'!N115)","v":""},0,0]
["SiteManager Agg. Sample ID #4",0,"AMMIXPACK",1,218,{"$f":"IF('Design Data'!N116=\"\",\"\",'Design Data'!N116)","v":""},0,0]
["SiteManager Agg. Sample ID #5",0,"AMMIXPACK",1,219,{"$f":"IF('Design Data'!N117=\"\",\"\",'Design Data'!N117)","v":""},0,0]
["SiteManager Agg. Sample ID #6",0,"AMMIXPACK",1,220,{"$f":"IF('Design Data'!N118=\"\",\"\",'Design Data'!N118)","v":""},0,0]
["LABEL: 1-Pt. CHECK PROPERTIES",0,"AMMIXPACK",1,221," ",0,0]
["Unit Wt. (lb/ft3) =",0,"AMMIXPACK",1,222,null,{"$f":"IF('1-Pt. Check'!C30=\"\",0,ROUND('1-Pt. Check'!C30,1))","v":0},0]
["% Air Voids =",0,"AMMIXPACK",1,223,null,{"$f":"IF('1-Pt. Check'!C31=\"\",0,ROUND('1-Pt. Check'!C31,1))","v":0},0]
["% VFA =",0,"AMMIXPACK",1,224,null,{"$f":"IF('1-Pt. Check'!C32=\"\",0,ROUND('1-Pt. Check'!C32,1))","v":0},0]
["Gsb =",0,"AMMIXPACK",1,225,null,{"$f":"IF('1-Pt. Check'!C33=\"\",0,ROUND('1-Pt. Check'!C33,2))","v":0},0]
["D/A Ratio =",0,"AMMIXPACK",1,226,null,{"$f":"IF('1-Pt. Check'!E30=\"\",0,ROUND('1-Pt. Check'!E30,1))","v":0},0]
["Gmm =",{"$f":"B234","v":0},"AMMIXPACK",1,227,null,{"$f":"IF('1-Pt. Check'!E31=\"\",0,ROUND('1-Pt. Check'!E31,3))","v":0},0]
["% Eff. AC =",0,"AMMIXPACK",1,228,null,{"$f":"IF('1-Pt. Check'!E32=\"\",0,ROUND('1-Pt. Check'!E32,1))","v":0},0]
["Gse =",0,"AMMIXPACK",1,229,null,{"$f":"IF('1-Pt. Check'!E33=\"\",0,ROUND('1-Pt. Check'!E33,3))","v":0},0]
["AC (%) =",0,"AMMIXPACK",1,230,null,{"$f":"IF('1-Pt. Check'!H30=\"\",0,ROUND('1-Pt. Check'!H30,1))","v":0},0]
["% VMA =",0,"AMMIXPACK",1,231,null,{"$f":"IF('1-Pt. Check'!H31=\"\",0,ROUND('1-Pt. Check'!H31,1))","v":0},0]
["% Abs. AC (Mix) =",0,"AMMIXPACK",1,232,null,{"$f":"IF('1-Pt. Check'!H32=\"\",0,ROUND('1-Pt. Check'!H32,2))","v":0},0]
["ESAL Class",0,"AMMIXPACK",1,233,{"$f":"'1-Pt. Check'!H33","v":""},0,0]
["LABEL: MCL CONSENSUS (& ADDITIONAL) VERIFICATION INFORMATION",0,"AMMIXPACK",1,234," ",0,0]
["TEST TYPE",0,"AMMIXPACK",1,235,{"$f":"IF('Design Data'!J122=\"\",\"\",'Design Data'!J122)","v":""},0,0]
["TEST TYPE #2",0,"AMMIXPACK",1,236,{"$f":"IF('Design Data'!J123=\"\",\"\",'Design Data'!J123)","v":""},0,0]
["TEST TYPE #3",0,"AMMIXPACK",1,237,{"$f":"IF('Design Data'!J124=\"\",\"\",'Design Data'!J124)","v":""},0,0]
["TEST TYPE #4",0,"AMMIXPACK",1,238,{"$f":"IF('Design Data'!J125=\"\",\"\",'Design Data'!J125)","v":""},0,0]
["TEST TYPE #5",0,"AMMIXPACK",1,239,{"$f":"IF('Design Data'!J126=\"\",\"\",'Design Data'!J126)","v":""},0,0]
["TEST TYPE #6",0,"AMMIXPACK",1,240,{"$f":"IF('Design Data'!J127=\"\",\"\",'Design Data'!J127)","v":""},0,0]
["S/C",0,"AMMIXPACK",1,241,{"$f":"IF('Design Data'!M122=\"\",\"\",'Design Data'!M122)","v":""},0,0]
["MCL S/C #2",0,"AMMIXPACK",1,242,{"$f":"IF('Design Data'!M123=\"\",\"\",'Design Data'!M123)","v":""},0,0]
["MCL S/C #3",{"$f":"B250","v":0},"AMMIXPACK",1,243,{"$f":"IF('Design Data'!M124=\"\",\"\",'Design Data'!M124)","v":""},0,0]
["MCL S/C #4",0,"AMMIXPACK",1,244,{"$f":"IF('Design Data'!M125=\"\",\"\",'Design Data'!M125)","v":""},0,0]
["MCL S/C #5",0,"AMMIXPACK",1,245,{"$f":"IF('Design Data'!M126=\"\",\"\",'Design Data'!M126)","v":""},0,0]
["MCL S/C #6",0,"AMMIXPACK",1,246,{"$f":"IF('Design Data'!M127=\"\",\"\",'Design Data'!M127)","v":""},0,0]
["SiteManager Sample ID #",0,"AMMIXPACK",1,247,{"$f":"IF('Design Data'!N122=\"\",\"\",'Design Data'!N122)","v":""},0,0]
["SiteManager Sample ID #2",0,"AMMIXPACK",1,248,{"$f":"IF('Design Data'!N123=\"\",\"\",'Design Data'!N123)","v":""},0,0]
["SiteManager Sample ID #3",0,"AMMIXPACK",1,249,{"$f":"IF('Design Data'!N124=\"\",\"\",'Design Data'!N124)","v":""},0,0]
["SiteManager Sample ID #4",0,"AMMIXPACK",1,250,{"$f":"IF('Design Data'!N125=\"\",\"\",'Design Data'!N125)","v":""},0,0]
["SiteManager Sample ID #5",0,"AMMIXPACK",1,251,{"$f":"IF('Design Data'!N126=\"\",\"\",'Design Data'!N126)","v":""},0,0]
["SiteManager Sample ID #6",0,"AMMIXPACK",1,252,{"$f":"IF('Design Data'!N127=\"\",\"\",'Design Data'!N127)","v":""},0,0]
["TOTAL UNIT TEST COST",0,"AMMIXPACK",1,253,null,{"$f":"IF('Chart Data'!T15=\"\",0,ROUND('Chart Data'!T15,2))","v":0},0]
["WMA Planned Production Temp.",0,"AMMIXPACK",1,"255",{"$f":"IF('Design Data'!P94=\"\",\"\",'Design Data'!P94)","v":""},0,{"$f":"H261","v":0}]
["WMA Process/Product",0,"AMMIXPACK",1,"256",{"$f":"IF('Design Data'!P95=\"\",\"\",'Design Data'!P95)","v":""},0,{"$f":"H262","v":0}]
["WMA Additive %",0,"AMMIXPACK",1,"257",{"$f":"IF('Design Data'!P96=\"\",\"\",'Design Data'!P96)","v":""},0,{"$f":"H263","v":0}]
["Perf. Spec. Avg % Air Voids # 1",0,"AMMIXPACK",1,"258",null,{"$f":"IF('Performance Specimens'!H41=\"\",0,'Performance Specimens'!H41)","v":0},{"$f":"H264","v":0}]
["Perf. Spec. Avg % Air Voids # 2",0,"AMMIXPACK",1,"259",null,{"$f":"IF('Performance Specimens'!O41=\"\",0,'Performance Specimens'!O41)","v":0},0]
["Perf. Spec. Made With",{"$f":"B266","v":0},"AMMIXPACK",1,"260",{"$f":"'Chart Data'!AJ37","v":""},null,0]
["CT l75 #1",0,"AMMIXPACK",1,"261",null,{"$f":"IF('KYCT Data'!$B$14=\"\",0,'KYCT Data'!$B$14)","v":0},0]
["CT m75 #1",0,"AMMIXPACK",1,"262",null,{"$f":"IF('KYCT Data'!$B$18=\"\",0,'KYCT Data'!$B$18)","v":0},0]
["CT Wf #1",0,"AMMIXPACK",1,"263",null,{"$f":"IF('KYCT Data'!$B$19=\"\",0,'KYCT Data'!$B$19)","v":0},0]
["CT Gf #1",0,"AMMIXPACK",1,"264",null,{"$f":"IF('KYCT Data'!$B$20=\"\",0,'KYCT Data'!$B$20)","v":0},0]
["CT Index #1",0,"AMMIXPACK",1,265,null,{"$f":"IF('KYCT Data'!$B$21=\"\",0,'KYCT Data'!$B$21)","v":0},0]
["CT l75 #2",0,"AMMIXPACK",1,266,null,{"$f":"IF('KYCT Data'!$D$14=\"\",0,'KYCT Data'!$D$14)","v":0},0]
["CT m75 #2",0,"AMMIXPACK",1,267,null,{"$f":"IF('KYCT Data'!$D$18=\"\",0,'KYCT Data'!$D$18)","v":0},0]
["CT Wf #2",0,"AMMIXPACK",1,268,null,{"$f":"IF('KYCT Data'!$D$19=\"\",0,'KYCT Data'!$D$19)","v":0},0]
["CT Gf #2",0,"AMMIXPACK",1,269,null,{"$f":"IF('KYCT Data'!$D$20=\"\",0,'KYCT Data'!$D$20)","v":0},0]
["CT Index #2",0,"AMMIXPACK",1,270,null,{"$f":"IF('KYCT Data'!$D$21=\"\",0,'KYCT Data'!$D$21)","v":0},0]
["CT l75 #3",0,"AMMIXPACK",1,271,null,{"$f":"IF('KYCT Data'!$F$14=\"\",0,'KYCT Data'!$F$14)","v":0},0]
["CT m75 #3",0,"AMMIXPACK",1,272,null,{"$f":"IF('KYCT Data'!$F$18=\"\",0,'KYCT Data'!$F$18)","v":0},0]
["CT Wf #3",0,"AMMIXPACK",1,273,null,{"$f":"IF('KYCT Data'!$F$19=\"\",0,'KYCT Data'!$F$19)","v":0},0]
["CT Gf #3",0,"AMMIXPACK",1,274,null,{"$f":"IF('KYCT Data'!$F$20=\"\",0,'KYCT Data'!$F$20)","v":0},0]
["CT Index #3",0,"AMMIXPACK",1,275,null,{"$f":"IF('KYCT Data'!$F$21=\"\",0,'KYCT Data'!$F$21)","v":0},0]
["CT l75 #4",{"$f":"B282","v":0},"AMMIXPACK",1,276,null,{"$f":"IF('KYCT Data'!$H$14=\"\",0,'KYCT Data'!$H$14)","v":0},0]
["CT m75 #4",0,"AMMIXPACK",1,277,null,{"$f":"IF('KYCT Data'!$H$18=\"\",0,'KYCT Data'!$H$18)","v":0},0]
["CT Wf #4",0,"AMMIXPACK",1,278,null,{"$f":"IF('KYCT Data'!$H$19=\"\",0,'KYCT Data'!$H$19)","v":0},0]
["CT Gf #4",0,"AMMIXPACK",1,279,null,{"$f":"IF('KYCT Data'!$H$20=\"\",0,'KYCT Data'!$H$20)","v":0},0]
["CT Index #4",0,"AMMIXPACK",1,280,null,{"$f":"IF('KYCT Data'!$H$21=\"\",0,'KYCT Data'!$H$21)","v":0},0]
["CT l75 #5",0,"AMMIXPACK",1,281,null,{"$f":"IF('KYCT Data'!$J$14=\"\",0,'KYCT Data'!$J$14)","v":0},0]
["CT m75 #5",0,"AMMIXPACK",1,282,null,{"$f":"IF('KYCT Data'!$J$18=\"\",0,'KYCT Data'!$J$18)","v":0},0]
["CT Wf #5",0,"AMMIXPACK",1,283,null,{"$f":"IF('KYCT Data'!$J$19=\"\",0,'KYCT Data'!$J$19)","v":0},0]
["CT Gf #5",0,"AMMIXPACK",1,284,null,{"$f":"IF('KYCT Data'!$J$20=\"\",0,'KYCT Data'!$J$20)","v":0},0]
["CT Index #5",0,"AMMIXPACK",1,285,null,{"$f":"IF('KYCT Data'!$J$21=\"\",0,'KYCT Data'!$J$21)","v":0},0]
["CT l75 #6",0,"AMMIXPACK",1,286,null,{"$f":"IF('KYCT Data'!$L$14=\"\",0,'KYCT Data'!$L$14)","v":0},0]
["CT m75 #6",0,"AMMIXPACK",1,287,null,{"$f":"IF('KYCT Data'!$L$18=\"\",0,'KYCT Data'!$L$18)","v":0},0]
["CT Wf #6",0,"AMMIXPACK",1,288,null,{"$f":"IF('KYCT Data'!$L$19=\"\",0,'KYCT Data'!$L$19)","v":0},0]
["CT Gf #6",0,"AMMIXPACK",1,289,null,{"$f":"IF('KYCT Data'!$L$20=\"\",0,'KYCT Data'!$L$20)","v":0},0]
["CT Index #6",0,"AMMIXPACK",1,290,null,{"$f":"IF('KYCT Data'!$L$21=\"\",0,'KYCT Data'!$L$21)","v":0},0]
["CT l75 #7",0,"AMMIXPACK",1,291,null,{"$f":"IF('KYCT Data'!$N$14=\"\",0,'KYCT Data'!$N$14)","v":0},0]
["CT m75 #7",{"$f":"B298","v":0},"AMMIXPACK",1,292,null,{"$f":"IF('KYCT Data'!$N$18=\"\",0,'KYCT Data'!$N$18)","v":0},0]
["CT Wf #7",0,"AMMIXPACK",1,293,null,{"$f":"IF('KYCT Data'!$N$19=\"\",0,'KYCT Data'!$N$19)","v":0},0]
["CT Gf #7",0,"AMMIXPACK",1,294,null,{"$f":"IF('KYCT Data'!$N$20=\"\",0,'KYCT Data'!$N$20)","v":0},0]
["CT Index #7",0,"AMMIXPACK",1,295,null,{"$f":"IF('KYCT Data'!$N$21=\"\",0,'KYCT Data'!$N$21)","v":0},0]
["CT l75 #8",0,"AMMIXPACK",1,296,null,{"$f":"IF('KYCT Data'!$P$14=\"\",0,'KYCT Data'!$P$14)","v":0},0]
["CT m75 #8",0,"AMMIXPACK",1,297,null,{"$f":"IF('KYCT Data'!$P$18=\"\",0,'KYCT Data'!$P$18)","v":0},0]
["CT Wf #8",0,"AMMIXPACK",1,298,null,{"$f":"IF('KYCT Data'!$P$19=\"\",0,'KYCT Data'!$P$19)","v":0},0]
["CT Gf #8",0,"AMMIXPACK",1,299,null,{"$f":"IF('KYCT Data'!$P$20=\"\",0,'KYCT Data'!$P$20)","v":0},0]
["CT Index #8",0,"AMMIXPACK",1,300,null,{"$f":"IF('KYCT Data'!$P$21=\"\",0,'KYCT Data'!$P$21)","v":0},0]
["Hamburg Made With",0,"AMMIXPACK",1,301,{"$f":"'Chart Data'!AJ37","v":""},null,0]
["Hamburg Pass 100 Left Max",0,"AMMIXPACK",1,302,null,{"$f":"IF('Hamburg Data'!$J$19=\"\",0,'Hamburg Data'!$J$19)","v":0},0]
["Hamburg Pass 100 Right Max",0,"AMMIXPACK",1,303,null,{"$f":"IF('Hamburg Data'!$M$19=\"\",0,'Hamburg Data'!$M$19)","v":0},0]
["Hamburg Pass 5000 Left Max",0,"AMMIXPACK",1,304,null,{"$f":"IF('Hamburg Data'!$J$20=\"\",0,'Hamburg Data'!$J$20)","v":0},0]
["Hamburg Pass 5000 Right Max",0,"AMMIXPACK",1,305,null,{"$f":"IF('Hamburg Data'!$M$20=\"\",0,'Hamburg Data'!$M$20)","v":0},0]
["Hamburg Pass 10000 Left Max",0,"AMMIXPACK",1,306,null,{"$f":"IF('Hamburg Data'!$J$21=\"\",0,'Hamburg Data'!$J$21)","v":0},0]
["Hamburg Pass 10000 Right Max",0,"AMMIXPACK",1,307,null,{"$f":"IF('Hamburg Data'!$M$21=\"\",0,'Hamburg Data'!$M$21)","v":0},0]
["Hamburg Pass 15000 Left Max",{"$f":"B314","v":0},"AMMIXPACK",1,308,null,{"$f":"IF('Hamburg Data'!$J$22=\"\",0,'Hamburg Data'!$J$22)","v":0},0]
["Hamburg Pass 15000 Right Max",0,"AMMIXPACK",1,309,null,{"$f":"IF('Hamburg Data'!$M$22=\"\",0,'Hamburg Data'!$M$22)","v":0},0]
["Hamburg Pass 20000 Left Max",0,"AMMIXPACK",1,310,null,{"$f":"IF('Hamburg Data'!$J$23=\"\",0,'Hamburg Data'!$J$23)","v":0},0]
["Hamburg Pass 20000 Right Max",0,"AMMIXPACK",1,311,null,{"$f":"IF('Hamburg Data'!$M$23=\"\",0,'Hamburg Data'!$M$23)","v":0},0]
["Hamburg Pass 25000 Left Max",0,"AMMIXPACK",1,312,null,{"$f":"IF('Hamburg Data'!$J$24=\"\",0,'Hamburg Data'!$J$24)","v":0},0]
["Hamburg Pass 25000 Right Max",0,"AMMIXPACK",1,313,null,{"$f":"IF('Hamburg Data'!$M$24=\"\",0,'Hamburg Data'!$M$24)","v":0},0]
["Hamburg Max Deformation Left Max",0,"AMMIXPACK",1,314,null,{"$f":"IF('Hamburg Data'!$J$26=\"\",0,'Hamburg Data'!$J$26)","v":0},0]
["Hamburg Max Deformation Right Max",0,"AMMIXPACK",1,315,null,{"$f":"IF('Hamburg Data'!$M$26=\"\",0,'Hamburg Data'!$M$26)","v":0},0]
["Hamburg Pass Number Left Max",0,"AMMIXPACK",1,316,null,{"$f":"IF('Hamburg Data'!$J$27=\"\",0,'Hamburg Data'!$J$27)","v":0},0]
["Hamburg Pass Number Right Max",0,"AMMIXPACK",1,317,null,{"$f":"IF('Hamburg Data'!$M$27=\"\",0,'Hamburg Data'!$M$27)","v":0},0]
["Hamburg SIP Left Max",0,"AMMIXPACK",1,318,null,{"$f":"IF('Hamburg Data'!$J$28=\"\",0,'Hamburg Data'!$J$28)","v":0},0]
["Hamburg SIP Right Max",0,"AMMIXPACK",1,319,null,{"$f":"IF('Hamburg Data'!$M$28=\"\",0,'Hamburg Data'!$M$28)","v":0},0]
["CT Peak Flow # 1",{"$f":"B326","v":0},"AMMIXPACK",1,320,null,{"$f":"IF('KYCT Data'!A29=\"\",0,'KYCT Data'!A29)","v":0},0]
["CT Peak Stability # 1",{"$f":"B327","v":0},"AMMIXPACK",1,321,null,{"$f":"IF('KYCT Data'!B29=\"\",0,'KYCT Data'!B29)","v":0},0]
["CT Peak Flow # 2",{"$f":"B328","v":0},"AMMIXPACK",1,322,null,{"$f":"IF('KYCT Data'!C29=\"\",0,'KYCT Data'!C29)","v":0},{"$f":"H328","v":0}]
["CT Peak Stability # 2",{"$f":"B329","v":0},"AMMIXPACK",1,323,null,{"$f":"IF('KYCT Data'!D29=\"\",0,'KYCT Data'!D29)","v":0},0]
["CT Peak Flow # 3",{"$f":"B330","v":0},"AMMIXPACK",1,324,null,{"$f":"IF('KYCT Data'!E29=\"\",0,'KYCT Data'!E29)","v":0},0]
["CT Peak Stability # 3",{"$f":"B331","v":0},"AMMIXPACK",1,325,null,{"$f":"IF('KYCT Data'!F29=\"\",0,'KYCT Data'!F29)","v":0},0]
["CT Peak Flow # 4",{"$f":"B332","v":0},"AMMIXPACK",1,326,null,{"$f":"IF('KYCT Data'!G29=\"\",0,'KYCT Data'!G29)","v":0},0]
["CT Peak Stability # 4",{"$f":"B333","v":0},"AMMIXPACK",1,327,null,{"$f":"IF('KYCT Data'!H29=\"\",0,'KYCT Data'!H29)","v":0},0]
["CT Peak Flow # 5",{"$f":"B334","v":0},"AMMIXPACK",1,328,null,{"$f":"IF('KYCT Data'!I29=\"\",0,'KYCT Data'!I29)","v":0},0]
["CT Peak Stability # 5",{"$f":"B335","v":0},"AMMIXPACK",1,329,null,{"$f":"IF('KYCT Data'!J29=\"\",0,'KYCT Data'!J29)","v":0},0]
["CT Peak Flow # 6",{"$f":"B336","v":0},"AMMIXPACK",1,330,null,{"$f":"IF('KYCT Data'!K29=\"\",0,'KYCT Data'!K29)","v":0},0]
["CT Peak Stability # 6",{"$f":"B337","v":0},"AMMIXPACK",1,331,null,{"$f":"IF('KYCT Data'!L29=\"\",0,'KYCT Data'!L29)","v":0},0]
["CT Peak Flow # 7",{"$f":"B338","v":0},"AMMIXPACK",1,332,null,{"$f":"IF('KYCT Data'!M29=\"\",0,'KYCT Data'!M29)","v":0},0]
["CT Peak Stability # 7",{"$f":"B339","v":0},"AMMIXPACK",1,333,null,{"$f":"IF('KYCT Data'!N29=\"\",0,'KYCT Data'!N29)","v":0},0]
["CT Peak Flow # 8",{"$f":"B340","v":0},"AMMIXPACK",1,334,null,{"$f":"IF('KYCT Data'!O29=\"\",0,'KYCT Data'!O29)","v":0},0]
["CT Peak Stability # 8",{"$f":"B341","v":0},"AMMIXPACK",1,335,null,{"$f":"IF('KYCT Data'!P29=\"\",0,'KYCT Data'!P29)","v":0},0]

{"sheet":"t_superpave","index":25,"n_rows":8,"n_cols":36,"rows_kept":8,"cut":false,"hidden":true,"merged":[]}
["Special Processing",null,null,null,null,null,null,null,null,"c",null,null,null,null,null,null,null,null,null,null,null,null,null,null,null,null,null,null,null,null,"c","c","c",null,"d","c"]
["SM Table","t_superpave","t_superpave","t_superpave","t_superpave","t_superpave","t_superpave","t_superpave","t_superpave","t_superpave","t_superpave","t_superpave","t_superpave","t_superpave","t_superpave","t_superpave","t_superpave","t_superpave","t_superpave","t_superpave","t_superpave","t_superpave","t_superpave","t_superpave",null,null,null,null,null,null,null,null,null,"t_superpave","t_superpave"]
["SM Column","mix_id","dsn_t","matl_cd","prodr_supp_cd","dsnr_nm","asph_cem_t","mix_dsn_txt_t","effdt","term_dt","apprd_dt","apprd_by_uid","init_n_dnsty_m","max_n_dnsty_m","dsn_n_dnsty_m","init_n_gmm_p","max_n_gmm_p","esals_nbr","opt_ac_pct_tot_wt","dust_proprtn_p","vma_p","vfa_p","lotmn_tsr_m","sand_equiv_tst","max_spc_gr","bulk_spc_gr_m","mix_temp","mix_temp_unt","cmpct_temp","cmpct_temp_unt","high_air_temp","high_air_temp_unt","rmrks_id","last_modfd_uid","last_modfd_dt","air_voids_p"]
["Logical Validation","No duplicates of key (highlighted in yellow);\n","Existing on t_cd_tbl_dtl (cd_id)\nAND t_cd_tbl_dtl.tbl_id='DSNTYPE'","Existing on t_matl\nAND t.matl_actvty_stat_t = \"A\"","Existing on t_prodr_supp\nAND t_prodr_supp.actvty_stat_t = \"A\"\nAND smpl_dt (since only 1 sample) is between \n            t_prodr_supp_matl.effdt & exp_dt\n            (for the matl_cd above)","Existing on t_matl_user \nAND  t_matl_user.smplr_ind='Y\"\nAND  active sampler qualification of \"Superpave Mix Design Tech.\" \n        (  I.e., At least one row returned from:\n         SELECT * FROM t_insp_qualfn\n         WHERE smpld_by = smpld_by\n         AND      insp_qualfn_t = \"ASMD\"\n         AND      qualfn_lev_t = \"SMDT\"\n         AND      exp_dt >= t_smpl.smpl_dt (since only 1 sample)\n         AND      effdt     <= t_smpl.smpl_dt (since only 1 sample)   )\n         ","Existing on t_cd_tbl_dtl (cd_id)\nAND t_cd_tbl_dtl.tbl_id='ASPHCEM'","Existing on t_cd_tbl_dtl (cd_id)\nAND t_cd_tbl_dtl.tbl_id='MIXDSN'",null,null,null,"Existing on t_matl_user \nAND  t_matl_user.smplr_ind='Y\"\nAND  active sampler qualification of \"Superpave Mix Design Tech.\" \n        (  I.e., At least one row returned from:\n         SELECT * FROM t_insp_qualfn\n         WHERE smpld_by = smpld_by\n         AND      insp_qualfn_t = \"ASMD\"\n         AND      qualfn_lev_t = \"SMDT\"\n         AND      exp_dt >= t_smpl.smpl_dt (same keys as current row)\n         AND      effdt     <= t_smpl.smpl_dt (same keys as current row)   )\n         ",null,null,null,null,null,null,null,null,null,null,null,null,null,null,null,"Existing on t_cd_tbl_dtl (cd_id)\nAND t_cd_tbl_dtl.tbl_id='TEMP'",null,"Existing on t_cd_tbl_dtl (cd_id)\nAND t_cd_tbl_dtl.tbl_id='TEMP'"]
["Comment",null,null,null,null,"The Approver must have active \"SUPERPAVE MIX DESIGN TECHNOLOGIST\" Sampler qualification (and therefore have a SM User ID) for a Material Category of \"ASPHALT-MIX DESIGN\".",null,null,null,"Not Used\nInitialized to 0",null,"The Approver must have active \"SUPERPAVE MIX DESIGN TECHNOLOGIST\" Sampler qualification (and therefore have a SM User ID) for a Material Category of \"ASPHALT-MIX DESIGN\".","numeric(3.0)","numeric(3.0)","numeric(3.0)\n\nValues can only be 50, 75, 100, 125, (or blank - i.e., since numeric field, blank will be stored as a 0).","varchar(18)","varchar(18)","numeric(12.0)\n\n\"N/A\" or blanks have been translated to zero (0) below.",null,"varchar(18)","varchar(18)","varchar(18)","varchar(18)","numeric(3.0)\n\nRounded to nearest whole number below.","varchar(18)","varchar(18)",null,null,null,null,"Not Used\nInitialized to 0","Not Used\nInitialized to \" \" (i.e., space)","Not Used\nInitialized to \" \" (i.e., space)",null,"Current system date","Not Used\nInitialized to \" \" (i.e., space)"]
["Long Description","Mix ID","Design Type","Material Code","Producer Supplier Code","Designer Name","AC Type","Mix Type","Effective Date","Termination Date","Approved Date","Approved By User ID","N (Initial)","N (Max)","N (Design)","% Gmm @ N (Init)","% Gmm @ N (Max)","Equiv Single Axle Loads","Optimum AC % by Tot Weight","Dust Proportion","VMA %","VFA %","Lottman TSR","Sand Equivalent","Maximum Specific Gravity","Bulk Specific Gravity","Mixing Temperature","Mixing Temperature Units Type","Compaction Temp","Compaction Temperature Units Type","High Air Temperature","High Air Temperature Units Type","Remarks","Last Modified User ID","Last Modified Date","Air Voids Percentage"]
["User Entry                                     XML Schema \nSheet Map                                   Column Name","mix_id","dsn_t","matl_cd","prodr_supp_cd","dsnr_nm","asph_cem_t","mix_dsn_txt_t","effdt","term_dt","apprd_dt","apprd_by_uid","init_n_dnsty_m","max_n_dnsty_m","dsn_n_dnsty_m","init_n_gmm_p","max_n_gmm_p","esals_nbr","opt_ac_pct_tot_wt","dust_proprtn_p","vma_p","vfa_p","lotmn_tsr_m","sand_equiv_tst","max_spc_gr","bulk_spc_gr_m","mix_temp","mix_temp_unt","cmpct_temp","cmpct_temp_unt","high_air_temp","high_air_temp_unt","rmrks_id","last_modfd_uid","last_modfd_dt","air_voids_p"]
[null,{"$f":"'Design Data'!H10","v":0},"SUP",{"$f":"'Design Data'!Q16","v":""},{"$f":"'Design Data'!Q14","v":{"$error":"#N/A"}},{"$f":"'Design Data'!K16","v":0},{"$f":"'Chart Data'!E48","v":""},{"$f":"'Chart Data'!M48","v":""},{"$f":"'Design Data'!H16","v":"00:00:00"},0,{"$f":"'Design Data'!H16","v":"00:00:00"},{"$f":"IF('Design Data'!S82=\"\",\"\",'Design Data'!S82)","v":""},{"$f":"'Design Data'!Q87","v":""},{"$f":"'Design Data'!Q89","v":""},{"$f":"'Design Data'!Q88","v":""},{"$f":"IF('Design Data'!O59=\"\",\"\",ROUND('Design Data'!O59,1))","v":""},{"$f":"IF('Design Data'!O60=\"\",\"\",ROUND('Design Data'!O60,1))","v":""},{"$f":"IF('Design Data'!H20=\"N/A\",0,IF('Design Data'!H20=\" \",0,'Design Data'!H20))","v":""},{"$f":"IF('Design Data'!O63=\"\",0,ROUND('Design Data'!O63,1))","v":0},{"$f":"IF('Design Data'!O58=\"\",\"\",ROUND('Design Data'!O58,1))","v":""},{"$f":"IF('Design Data'!O57=\"\",\"\",ROUND('Design Data'!O57,1))","v":""},{"$f":"IF('Design Data'!O56=\"\",\"\",ROUND('Design Data'!O56,1))","v":""},{"$f":"IF('Design Data'!O72=\"\",\"\",ROUND('Design Data'!O72,0))","v":""},{"$f":"ROUND('Design Data'!O55,0)","v":0},{"$f":"IF('Design Data'!O65=\"\",0,ROUND('Design Data'!O65,3))","v":0},{"$f":"IF('Design Data'!O62=\"\",0,ROUND('Design Data'!O62,1))","v":0},{"$f":"'Design Data'!K18","v":""},"DEGF",{"$f":"'Design Data'!K18","v":""},"DEGF"," "," "," ",{"$f":"'Design Data'!S82","v":0},null," "]

{"sheet":"t_bit_conc_mixblnd","index":26,"n_rows":14,"n_cols":36,"rows_kept":14,"cut":false,"hidden":true,"merged":[]}
["Special Processing",null,null,null,null,"c",null,null,null,null,null,"d"]
["SM Table","t_bit_conc_mixblnd","t_bit_conc_mixblnd","t_bit_conc_mixblnd","t_bit_conc_mixblnd","t_bit_conc_mixblnd","t_bit_conc_mixblnd","t_bit_conc_mixblnd","t_bit_conc_mixblnd","t_bit_conc_mixblnd","t_bit_conc_mixblnd","t_bit_conc_mixblnd"]
["SM Column","mix_id","dsn_t","matl_cd","prodr_supp_cd","brnd_nm","blnd_p","bulk_spc_gr_m","aprnt_spc_gr_m","smpl_id","last_modfd_uid","last_modfd_dt"]
["Logical Validation","No duplicates of key (highlighted in yellow);\n","Existing on t_cd_tbl_dtl (cd_id)\nAND t_cd_tbl_dtl.tbl_id='DSNTYPE'","Existing on t_matl\nAND t.matl_actvty_stat_t = \"A\"","Existing on t_prodr_supp\nAND t_prodr_supp.actvty_stat_t = \"A\"\nAND smpl_dt (since only 1 sample) is between \n            t_prodr_supp_matl.effdt & exp_dt\n            (for the matl_cd left one column)",null,null,null,null,"Existing on t_smpl"]
["Comment","If all four key fields are not present, DO NOT write a record to Sitemanager.","If all four key fields are not present, DO NOT write a record to Sitemanager.","If all four key fields are not present, DO NOT write a record to Sitemanager.","If all four key fields are not present, DO NOT write a record to Sitemanager.","Not Used\nInitialized to \" \" (i.e., space)","varchar(18)","varchar(18)","varchar(18)\n\nBinder: N/A",null,null,"Current system date"]
["Long Description","Mix ID","Design Type","Material Code","Producer Supplier Code","Brand Name","Blend Percent","Specific Gravity (Bulk)","Specific Gravity (Apparent)","Sample ID","Last Modified User ID","Last Modified Date"]
["User Entry                                     XML Schema \nSheet Map                                   Column Name","mix_id","dsn_t","matl_cd","prodr_supp_cd","brnd_nm","blnd_p","bulk_spc_gr_m","aprnt_spc_gr_m","smpl_id","last_modfd_uid","last_modfd_dt","ns1:init_n_dnsty_m","ns1:max_n_dnsty_m","ns1:dsn_n_dnsty_m","ns1:init_n_gmm_p","ns1:max_n_gmm_p","ns1:esals_nbr","ns1:opt_ac_pct_tot_wt","ns1:dust_proprtn_p","ns1:vma_p","ns1:vfa_p","ns1:lotmn_tsr_m","ns1:sand_equiv_tst","ns1:max_spc_gr","ns1:bulk_spc_gr_m","ns1:mix_temp","ns1:mix_temp_unt","ns1:cmpct_temp","ns1:cmpct_temp_unt","ns1:high_air_temp","ns1:high_air_temp_unt","ns1:rmrks_id","ns1:last_modfd_uid","ns1:last_modfd_dt","ns1:air_voids_p"]
["Binder Material",{"$f":"IF(D8=\"\",\"\",IF(E8=\"\",\"\",'Design Data'!H10))","v":""},{"$f":"IF(B8=\"\",\"\",\"SUP\")","v":""},{"$f":"IF('Design Data'!C20=\"\",\"\",'Design Data'!C20)","v":""},{"$f":"IF('Design Data'!H18=\"\",\"\",'Design Data'!H18)","v":""}," ",{"$f":"IF('Design Data'!O63=\"\",0,ROUND('Design Data'!O63,1))","v":0},{"$f":"ROUND('Design Data'!O25,3)","v":1.03},"N/A",{"$f":"IF('Design Data'!N127=\"\",\"\",IF('Design Data'!N127=\"N/A\",\"\",'Design Data'!N127))","v":""},{"$f":"'Design Data'!S82","v":0}]
["Aggregate Material 1",{"$f":"IF(D9=\"\",\"\",IF(E9=\"\",\"\",'Design Data'!H10))","v":""},{"$f":"IF(B9=\"\",\"\",\"SUP\")","v":""},{"$f":"IF('Design Data'!H23=\"\",\"\",'Design Data'!H23)","v":""},{"$f":"IF('Design Data'!A23=\"\",\"\",'Design Data'!A23)","v":""}," ",{"$f":"IF('Design Data'!M23=\"\",0,ROUND('Design Data'!M23,0))","v":0},{"$f":"IF('Design Data'!L23=\"\",0,ROUND('Design Data'!L23,2))","v":0},{"$f":"IF('Design Data'!M113=\"\",\"\",'Design Data'!M113)","v":""},{"$f":"IF('Design Data'!N113=\"\",\"\",IF('Design Data'!N113=\"N/A\",\"\",'Design Data'!N113))","v":""},{"$f":"K8","v":0}]
["Aggregate Material 2",{"$f":"IF(D10=\"\",\"\",IF(E10=\"\",\"\",'Design Data'!H10))","v":""},"",{"$f":"IF('Design Data'!H24=\"\",\"\",'Design Data'!H24)","v":""},{"$f":"IF('Design Data'!A24=\"\",\"\",'Design Data'!A24)","v":""}," ",{"$f":"IF('Design Data'!M24=\"\",0,ROUND('Design Data'!M24,0))","v":0},{"$f":"IF('Design Data'!L24=\"\",0,ROUND('Design Data'!L24,2))","v":0},{"$f":"IF('Design Data'!M114=\"\",\"\",'Design Data'!M114)","v":""},{"$f":"IF('Design Data'!N114=\"\",\"\",IF('Design Data'!N114=\"N/A\",\"\",'Design Data'!N114))","v":""},0]
["Aggregate Material 3",{"$f":"IF(D11=\"\",\"\",IF(E11=\"\",\"\",'Design Data'!H10))","v":""},"",{"$f":"IF('Design Data'!H25=\"\",\"\",'Design Data'!H25)","v":""},{"$f":"IF('Design Data'!A25=\"\",\"\",'Design Data'!A25)","v":""}," ",{"$f":"IF('Design Data'!M25=\"\",0,ROUND('Design Data'!M25,0))","v":0},{"$f":"IF('Design Data'!L25=\"\",0,ROUND('Design Data'!L25,2))","v":0},{"$f":"IF('Design Data'!M115=\"\",\"\",'Design Data'!M115)","v":""},{"$f":"IF('Design Data'!N115=\"\",\"\",IF('Design Data'!N115=\"N/A\",\"\",'Design Data'!N115))","v":""},0]
["Aggregate Material 4",{"$f":"IF(D12=\"\",\"\",IF(E12=\"\",\"\",'Design Data'!H10))","v":""},"",{"$f":"IF('Design Data'!H26=\"\",\"\",'Design Data'!H26)","v":""},{"$f":"IF('Design Data'!A26=\"\",\"\",'Design Data'!A26)","v":""}," ",{"$f":"IF('Design Data'!M26=\"\",0,ROUND('Design Data'!M26,0))","v":0},{"$f":"IF('Design Data'!L26=\"\",0,ROUND('Design Data'!L26,2))","v":0},{"$f":"IF('Design Data'!M116=\"\",\"\",'Design Data'!M116)","v":""},{"$f":"IF('Design Data'!N116=\"\",\"\",IF('Design Data'!N116=\"N/A\",\"\",'Design Data'!N116))","v":""},0]
["Aggregate Material 5",{"$f":"IF(D13=\"\",\"\",IF(E13=\"\",\"\",'Design Data'!H10))","v":""},"",{"$f":"IF('Design Data'!H27=\"\",\"\",'Design Data'!H27)","v":""},{"$f":"IF('Design Data'!A27=\"\",\"\",'Design Data'!A27)","v":""}," ",{"$f":"IF('Design Data'!M27=\"\",0,ROUND('Design Data'!M27,0))","v":0},{"$f":"IF('Design Data'!L27=\"\",0,ROUND('Design Data'!L27,2))","v":0},{"$f":"IF('Design Data'!M117=\"\",\"\",'Design Data'!M117)","v":""},{"$f":"IF('Design Data'!N117=\"\",\"\",IF('Design Data'!N117=\"N/A\",\"\",'Design Data'!N117))","v":""},0]
["Aggregate Material 6",{"$f":"IF(D14=\"\",\"\",IF(E14=\"\",\"\",'Design Data'!H10))","v":""},"",{"$f":"IF('Design Data'!H28=\"\",\"\",'Design Data'!H28)","v":""},{"$f":"IF('Design Data'!A28=\"\",\"\",'Design Data'!A28)","v":""}," ",{"$f":"IF('Design Data'!M28=\"\",0,ROUND('Design Data'!M28,0))","v":0},{"$f":"IF('Design Data'!L28=\"\",0,ROUND('Design Data'!L28,2))","v":0},{"$f":"IF('Design Data'!M118=\"\",\"\",'Design Data'!M118)","v":""},{"$f":"IF('Design Data'!N118=\"\",\"\",IF('Design Data'!N118=\"N/A\",\"\",'Design Data'!N118))","v":""},0]