{"text_format":"1","workbook":"xlsx","n_sheets":6,"sheets":["DSR Template","Random Testing Locations","Sheet2","Values","Full Report","Short Report for Printing"],"not_rendered":{"charts":0,"images":0,"macros":1,"external_links":0,"defined_names":6,"comments":2,"pivot_tables":0},"unopened":[],"bounds":{"document_bytes":16777216,"sheet_cells":100000,"rows_first":2000,"rows_last":500,"rows_between":2000,"halvings":0,"cell_chars":16384,"cell_head_chars":4096},"cells_cut":0,"cells_raw":0,"read":"whole","date_system":"1900"}

{"sheet":"DSR Template","index":0,"n_rows":49,"n_cols":14,"rows_kept":49,"cut":false,"hidden":false,"merged":[[28,1,28,2],[29,1,29,2],[23,1,23,2],[24,1,24,2],[25,1,25,2],[26,1,26,2],[27,1,27,2],[18,1,18,2],[19,1,19,2],[20,1,20,2],[21,1,21,2],[22,1,22,2],[48,0,48,13],[43,4,43,13],[44,10,45,10],[44,13,45,13],[44,1,44,3],[45,1,45,3],[43,1,43,2],[44,4,47,5],[46,0,47,0],[46,1,47,3],[46,10,47,13],[0,0,0,13],[1,0,1,13],[2,2,11,3],[2,4,2,13],[3,4,3,13],[4,4,4,13],[5,4,5,13],[6,4,6,13],[10,4,10,13],[11,4,11,13],[42,1,42,2],[13,1,13,2],[7,4,7,13],[8,4,8,13],[9,4,9,13],[12,0,12,13],[14,1,14,2],[30,1,30,2],[31,1,31,2],[32,1,32,2],[33,1,33,2],[40,1,40,2],[41,1,41,2],[15,1,15,2],[16,1,16,2],[17,1,17,2]]}
["Daily Striping Report"]
["Contractor & District Information"]
["DISTRICT",null,"CONTRACTOR"]
["CONTACT"]
["PROJECT TYPE:"]
["FUNDING STRIP:"]
{"$rows_left_out":44}
{"sheet":"Random Testing Locations","index":1,"n_rows":48,"n_cols":102,"rows_kept":48,"cut":false,"hidden":false,"merged":[[39,19,39,23],[41,0,41,5],[41,18,41,25],[4,0,4,6],[4,83,4,101],[4,64,4,82],[4,45,4,63],[4,26,4,44],[4,7,4,25],[44,1,44,2],[43,1,43,2],[42,1,42,2],[42,18,42,19],[41,37,41,44],[44,18,44,19],[43,18,43,19],[42,37,42,38],[43,37,43,38],[44,37,44,38],[47,1,47,2],[46,1,46,2],[45,1,45,2],[46,37,46,38],[47,37,47,38],[47,18,47,19],[46,18,46,19],[45,18,45,19],[45,37,45,38]]}
["Striped Line Length",{"$f":"SUM('DSR Template'!J15:J43)","v":0}]
["Number of Segments",{"$f":"IF(B1<10,1,IF(B1<30,3,5))","v":1}]
["Segment Length (Striped)",{"$f":"B1/B2","v":0}]
[]
["Route Information",null,null,null,null,null,null,"Segment 1",null,null,null,null,null,null,null,null,null,null,null,null,null,null,null,null,null,null,"Segment 2",null,null,null,null,null,null,null,null,null,null,null,null,null,null,null,null,null,null,"Segment 3",null,null,null,null,null,null,null,null,null,null,null,null,null,null,null,null,null,null,"Segment 4",null,null,null,null,null,null,null,null,null,null,null,null,null,null,null,null,null,null,"Segment 5"]
["Route","Route\nLength","Striped\nLength","Percent\nStriped","Begin\nMP","End\nMP","Dir","Length\n(Striped)","Length\n(Total)","Route1","R1 Name","Dir1","Route2","R2 Name","Dir2","Route3","R3 Name","Dir3","Begin MP","End MP","Zone 1\n(Striped)","Zone 1\n(Actual)","Zone 2\n(Striped)","Zone 2\n(Actual)","Zone 3\n(Striped)","Zone 3\n(Actual)","Length\n(Striped)","Length\n(Total)","Route1","R1 Name","Dir1","Route2","R2 Name","Dir2","Route3","R3 Name","Dir3","Begin MP","End MP","Zone 1\n(Striped)","Zone 1\n(Actual)","Zone 2\n(Striped)","Zone 2\n(Actual)","Zone 3\n(Striped)","Zone 3\n(Actual)","Length\n(Striped)","Length\n(Total)","Route1","R1 Name","Dir1","Route2","R2 Name","Dir2","Route3","R3 Name","Dir3","Begin MP","End MP","Zone 1\n(Striped)","Zone 1\n(Actual)","Zone 2\n(Striped)","Zone 2\n(Actual)","Zone 3\n(Striped)","Zone 3\n(Actual)","Length\n(Striped)","Length\n(Total)","Route1","R1 Name","Dir1","Route2","R2 Name","Dir2","Route3","R3 Name","Dir3","Begin MP","End MP","Zone 1\n(Striped)","Zone 1\n(Actual)","Zone 2\n(Striped)","Zone 2\n(Actual)","Zone 3\n(Striped)","Zone 3\n(Actual)","Length\n(Striped)","Length\n(Total)","Route1","R1 Name","Dir1","Route2","R2 Name","Dir2","Route3","R3 Name","Dir3","Begin MP","End MP","Zone 1\n(Striped)","Zone 1\n(Actual)","Zone 2\n(Striped)","Zone 2\n(Actual)","Zone 3\n(Striped)","Zone 3\n(Actual)"]
{"$rows_left_out":43}
{"sheet":"Sheet2","index":2,"n_rows":12,"n_cols":101,"rows_kept":12,"cut":false,"hidden":false,"merged":[]}
["Date","Time","Direction","GPS_Lat_Deg_ASCI","GPS_Lat_Hemi","GPS_Lon_Deg_ASCI","GPS_Lon_Hemi","MPH","County","Road","Line Type","Marker Number","Yellow MIL","White MIL","Black MIL","Yel Gal Used w/ Cat","Wht Gal Used w/ Cat","Blk Gal Used w/ Cat","Yel Gal Used w/o Cat","Wht Gal Used w/o Cat","Blk Gal Used w/o Cat","Yellow Feet","White Feet","Black Feet","Yellow Ave Temp","White Ave Temp","Black Ave Temp","Humidity Ave","Road Temp Ave","Air Temp Ave","Dew Point Ave","Bead1 Total LBS","Bead2 Total LBS","Bead3 Total LBS","Total LBS/Gal","Total LBS/100FTSQ","Total Feet Traveled","Batch 1","Batch 2","Batch 3","Batch 4","Bead 1","Bead 2","Employee 1","Employee 2","Employee 3","Employee 4","Employee 5","Employee 6","Employee 7","Employee 8","Employee 9","Employee 10","Batch 3","Line Width","Yellow Strokes","White Strokes","White LBS/Gal","Yellow LBS/Gal","Pump 2 Gal/Stroke","Pump 1 Gal/Stroke","Cat Gal/Stroke","Yellow RePaint Feet","White RePaint Feet","Yellow RePaint Gallons","White RePaint Gallons","Special Gun Line Type","Special Gun Width","Special Gun Footage","Gun1 Skip","Gun1 Solid","Gun2 Skip","Gun2 Solid","Gun3 Skip","Gun3 Solid","Gun4 Skip","Gun4 Solid","Gun5 Skip","Gun5 Solid","Gun6 Skip","Gun6 Solid","Gun7 Skip","Gun7 Solid","Gun1 Width","Gun2 Width","Gun3 Width","Gun4 Width","Gun5 Width","Gun6 Width","Gun7 Width","Gun1 Color","Gun2 Color","Gun3 Color","Gun4 Color","Gun5 Color","Gun6 Color","Gun7 Color","Job Start GPS Lat","Job Start GPS Lon","Current Job","Bead4 Total LBS"]
["2019-06-14","6:16:00 PM*","North ",38.208889999999997,null,-85.316491999999997,null,0,"jefferson","1819mp","_WEL","5.1-12.8",0,0,0,0,0,0,0,0,0,0,0,0,0,0,0,0,0,0,0,84,0,0,"∞","∞",0,"kp1904w0137","0_","_","NaN NaN NaN NaN",122818,120418,"Null_","Null_","Null_","Null_","Null_","Null_","Null_","Null_","Null_","_",null,4,0,0,5,1,0.24709999999999999,0.24759999999999999,null,null,null,null,null,"E",null,null,0,0,0,0,0,0,0,0,0,0,0,0,0,0,4,4,4,4,0,0,0,1,1,1,1,1,1,1,38.224553,-85.551955000000007,"No Job Selected","Null"]
["2019-06-14","8:40:25 PM*","North ",38.211621999999998,null,-85.538870000000003,null,0,"jefferson",913,"_WEL","1.5-1.8",0,20.358899999999998,0,0,3.2122999999999999,0,0,3.2122999999999999,0,0,759,0,0,0,0,0,0,0,0,2,0,0,14.631259999999999,18.57084,0,"kp1904w0137","0_","_","NaN NaN NaN NaN",122818,10119,"Null_","Null_","Null_","Null_","Null_","Null_","Null_","Null_","Null_","_",null,4,0,13,5,1,0.24709999999999999,0.24759999999999999,null,null,null,null,null,"End",null,null,0,0,55.765140000000002,703.4896,0,0,0,0,0,0,0,0,0,0,4,4,4,4,0,0,0,1,2,1,1,1,1,1,0,0,"No Job Selected","Null"]
["2019-06-14","8:55:08 PM*","North ",38.245041999999998,null,-85.544004999999999,null,0,"jefferson","1819rs","_WEL","12.8-13.6",0,15.991759999999999,0,0,12.6021,0,0,12.6021,0,0,3792,0,0,0,0,0,0,0,0,61,0,0,5.7926849999999996,5.7752650000000001,0,"kp1904w0137","0_","_","NaN NaN NaN NaN",122818,10119,"Null_","Null_","Null_","Null_","Null_","Null_","Null_","Null_","Null_","_",null,4,0,51,5,1,0.24709999999999999,0.24759999999999999,null,null,null,null,null,"End",null,null,0,0,19.452950000000001,3772.5810000000001,0,0,0,0,0,0,0,0,0,0,4,4,4,4,0,0,0,1,2,1,1,1,1,1,0,0,"No Job Selected","Null"]
["2019-06-14","9:01:58 PM*","South",38.236407,null,-85.543940000000006,null,10,"jefferson","1819rs","_WEL","13.6-12.8",0,15.71594,0,0,13.096299999999999,0,0,13.096299999999999,0,0,4010,0,36,95,92,25,84,92,81,56,0,0,3.8178719999999999,3.740739,4485,"kp1904w0137","0_","_","NaN NaN NaN NaN",122818,10119,"Null_","Null_","Null_","Null_","Null_","Null_","Null_","Null_","Null_","_",null,4,0,53,5,1,0.24709999999999999,0.24759999999999999,null,null,null,null,null,"End",null,null,0,0,0,4009.9029999999998,0,0,0,0,0,0,0,0,0,0,4,4,4,4,0,0,0,1,2,1,1,1,1,1,0,0,"No Job Selected","Null"]
["2019-06-14","9:30:41 PM*","North ",38.269165000000001,null,-85.614666999999997,null,8,"jefferson",2050,"_WEL","0-2.1",0,15.774839999999999,0,0,13.8376,0,0,13.8376,0,0,4221,0,36,94,91,25,82,91,80,107,0,0,8.0938890000000008,7.8514140000000001,5241,"kp1904w0137","0_","_","NaN NaN NaN NaN",122818,10119,"Null_","Null_","Null_","Null_","Null_","Null_","Null_","Null_","Null_","_",null,4,0,57,5,1,0.24709999999999999,0.24759999999999999,null,null,null,null,null,"Middle",null,null,0,0,16.387640000000001,4204.6710000000003,0,0,0,0,0,0,0,0,0,0,4,4,4,4,0,0,0,1,2,1,1,1,1,1,0,0,"No Job Selected","Null"]
{"$rows_left_out":7}
{"sheet":"Values","index":3,"n_rows":121,"n_cols":11,"rows_kept":121,"cut":false,"hidden":true,"merged":[]}
["Color","Width","Route Type","Counties","Direction","Line Type","Mobile","Corrective Restripe","Project Type","Application Type","District"]
["White",4,"RS","Adair","N","CL","Yes","Yes","District Wide Striping","Temporary","KY-D01"]
["Yellow",6,"MP","Allen","S","EL","No","No","Rehabilitation/Resurfacing","Permanent","KY-D02"]
[null,8,null,"Anderson","E","LL",null,null,null,null,"KY-D03"]
[null,12,null,"Ballard","W","SK",null,null,null,null,"KY-D04"]
[null,null,null,"Barren",null,"GM",null,null,null,null,"KY-D05"]
{"$rows_left_out":116}
{"sheet":"Full Report","index":4,"n_rows":234,"n_cols":40,"rows_kept":234,"cut":false,"hidden":false,"merged":[[7,33,7,37],[6,31,6,32],[6,33,6,37],[7,1,7,2],[7,3,7,4],[7,7,7,12],[7,13,7,16],[7,20,7,23],[7,25,7,28],[7,29,7,30],[7,31,7,32],[5,29,5,30],[5,31,5,32],[5,33,5,37],[6,1,6,2],[6,3,6,4],[6,7,6,12],[6,13,6,16],[6,20,6,23],[6,25,6,28],[6,29,6,30],[5,1,5,2],[5,3,5,4],[5,7,5,12],[5,13,5,16],[5,20,5,23],[5,25,5,28],[3,33,3,37],[4,1,4,2],[4,3,4,4],[4,7,4,12],[4,13,4,16],[4,20,4,23],[4,25,4,28],[4,29,4,30],[4,31,4,32],[4,33,4,37],[2,31,2,32],[2,33,2,37],[3,1,3,2],[3,3,3,4],[3,7,3,12],[3,13,3,16],[3,20,3,23],[3,25,3,28],[3,29,3,30],[3,31,3,32],[2,1,2,2],[2,3,2,4],[2,7,2,16],[2,20,2,23],[2,25,2,28],[2,29,2,30]]}
[]
[]
[null,"Project Name",null," ",null,null,null,"Employee Name",null,null,null,null,null,null,null,null,null,null,null,"Total Yellow Gal.",{"$f":"SUMIF(A10:A200,\"X\",Q10:Q200)","v":0},null,null,null,null,null,null,null,null,null,null,null,null,"Miles",null,null,null,null,null," "]
[null,"Date",null,{"$f":"Sheet2!A3","v":"2019-06-14"},null,null,null,{"$f":"Sheet2!AR3","v":"Null_"},null,null,null,null,null,{"$f":"Sheet2!AW3","v":"Null_"},null,null,null,null,null,"Total White Gal.",{"$f":"SUMIF(A10:A200,\"X\",R10:R200)","v":93.156700000000001},null,null,null,null,null,null,null,null,null,null,"Days Total CL",null,{"$f":"SUMIF(F10:F234,\"CL\",P10:P234)","v":0},null,null,null,null,null,{"$f":"SUMIF(F10:F89,\"CL\",N10:N89)","v":0}]
[null,"Start Time",null,{"$f":"Sheet2!B2","v":"6:16:00 PM*"},null,null,null,{"$f":"Sheet2!AS3","v":"Null_"},null,null,null,null,null,{"$f":"Sheet2!AX3","v":"Null_"},null,null,null,null,null,"Total Bead 1",{"$f":"SUMIF(A10:A200,\"X\",U10:U200)","v":540},null,null,null,null,null,null,null,null,null,null,"Days Total EL",null,{"$f":"SUMIF(F10:F234,\"EL\",P10:P234)","v":0},null,null,null,null,null,{"$f":"SUMIF(F10:F90,\"LL\",O10:O89)","v":0}]
[null,"Finish Time",null,{"$f":"INDEX(Sheet2!B2:B100,COUNT(Sheet2!M2:M100))","v":"11:20:58 PM*"},null,null,null,{"$f":"Sheet2!AT3","v":"Null_"},null,null,null,null,null,{"$f":"Sheet2!AY3","v":"Null_"},null,null,null,null,null,"Total Bead 2",{"$f":"SUMIF(A10:A200,\"X\",V10:V200)","v":0},null,null,null,null,null,null,null,null,null,null,"Days Total WEL",null,{"$f":"SUMIF(F10:F234,\"WEL\",P10:P234)","v":0},null,null,null,null,null,{"$f":"SUMIF(F10:F89,\"WEL\",O10:O89)","v":0}]
{"$rows_left_out":229}
{"sheet":"Short Report for Printing","index":5,"n_rows":88,"n_cols":23,"rows_kept":88,"cut":false,"hidden":false,"merged":[[6,16,6,18],[6,20,6,21],[7,0,7,2],[7,3,7,4],[7,7,7,8],[7,9,7,10],[7,12,7,13],[7,14,7,15],[7,16,7,18],[7,20,7,21],[6,0,6,2],[6,3,6,4],[6,7,6,8],[6,9,6,10],[6,12,6,13],[6,14,6,15],[4,16,4,18],[4,20,4,21],[5,0,5,2],[5,3,5,4],[5,7,5,8],[5,9,5,10],[5,12,5,13],[5,14,5,15],[5,16,5,18],[5,20,5,21],[4,0,4,2],[4,3,4,4],[4,7,4,8],[4,9,4,10],[4,12,4,13],[4,14,4,15],[2,20,2,21],[3,0,3,2],[3,3,3,4],[3,7,3,8],[3,9,3,10],[3,12,3,13],[3,14,3,15],[3,16,3,18],[3,20,3,21],[2,0,2,2],[2,3,2,4],[2,7,2,10],[2,12,2,13],[2,14,2,15],[2,16,2,18]]}
[]
[]
["Project Name",null,null,{"$f":"'Full Report'!D3","v":" "},null,null,null,"Employee Name",null,null,null,null,"Total Yellow Gal.",null,{"$f":"'Full Report'!U3&'Full Report'!V3&'Full Report'!W3&'Full Report'!X3","v":"0"},null,null,null,null,null,"MP",null,"Miles"]
["Date",null,null,{"$f":"'Full Report'!D4","v":"2019-06-14"},null,null,null,{"$f":"'Full Report'!H4&'Full Report'!I4&'Full Report'!J4&'Full Report'!K4&'Full Report'!L4&'Full Report'!M4","v":"Null_"},null,{"$f":"'Full Report'!N4&'Full Report'!O4&'Full Report'!P4&'Full Report'!Q4","v":"Null_"},null,null,"Total White Gal.",null,{"$f":"'Full Report'!U4&'Full Report'!V4&'Full Report'!W4&'Full Report'!X4","v":"93.1567"},null,null,null,null,null,"Days Total CL",null,{"$f":"'Full Report'!AH4","v":0}]
["Start Time",null,null,{"$f":"'Full Report'!D5","v":"6:16:00 PM*"},null,null,null,{"$f":"'Full Report'!H5&'Full Report'!I5&'Full Report'!J5&'Full Report'!K5&'Full Report'!L5&'Full Report'!M5","v":"Null_"},null,{"$f":"'Full Report'!N5&'Full Report'!O5&'Full Report'!P5&'Full Report'!Q5","v":"Null_"},null,null,"Total Bead1 LBS.",null,{"$f":"'Full Report'!U5&'Full Report'!V5&'Full Report'!W5&'Full Report'!X5","v":"540"},null,null,null,null,null,"Days Total SK",null,{"$f":"'Full Report'!AH5","v":0}]
["Finish Time",null,null,{"$f":"'Full Report'!D6","v":"11:20:58 PM*"},null,null,null,{"$f":"'Full Report'!H6&'Full Report'!I6&'Full Report'!J6&'Full Report'!K6&'Full Report'!L6&'Full Report'!M6","v":"Null_"},null,{"$f":"'Full Report'!N6&'Full Report'!O6&'Full Report'!P6&'Full Report'!Q6","v":"Null_"},null,null,"Total Bead2 LBS.",null,{"$f":"'Full Report'!U6&'Full Report'!V6&'Full Report'!W6&'Full Report'!X6","v":"0"},null,null,null,null,null,"Days Total WEL",null,{"$f":"'Full Report'!AH6","v":0}]
{"$rows_left_out":82}