{"text_format":"1","workbook":"xlsx","n_sheets":6,"sheets":["START","CompletionEval","YrEndEval","Contractor Information","YrEnd Ratings","Final Ratings"],"not_rendered":{"charts":0,"images":1,"macros":1,"external_links":0,"defined_names":51,"comments":2,"pivot_tables":0},"unopened":[],"bounds":{"document_bytes":16777216,"sheet_cells":100000,"rows_first":2000,"rows_last":500,"rows_between":2000,"halvings":0,"cell_chars":16384,"cell_head_chars":4096},"cells_cut":0,"cells_raw":0,"read":"whole","date_system":"1904"}

{"sheet":"START","index":0,"n_rows":1,"n_cols":1,"rows_kept":1,"cut":false,"hidden":false,"merged":[[0,0,16,9]]}
["Please Enable Macros Before Using this Form"]

{"sheet":"CompletionEval","index":1,"n_rows":36,"n_cols":8,"rows_kept":36,"cut":false,"hidden":false,"merged":[[0,1,0,5],[0,6,0,7],[3,4,3,6],[4,4,4,6],[5,4,5,6],[2,3,2,4],[2,5,2,6],[34,4,34,6],[32,4,32,5],[31,3,31,4],[6,4,6,6],[1,0,1,7],[25,1,29,6],[16,1,16,4],[20,1,20,4],[23,1,23,4],[8,1,8,7]]}
[null,"\nKentucky Transportation Cabinet   \n    Division of Construction Procurement                                                                   CONTRACTOR PERFORMANCE EVALUATION",null,null,null,null,"TC 63-74  04/2021"]
["Section 1: Project Completion Evaluation"]
["Name",null,null,"Prime/Sub?"]
["Contract ID#",null,null,"County"]
["Address",{"$f":"VLOOKUP(Name,'Contractor Information'!$A$2:$K$2501,4,FALSE)","v":{"$error":"#N/A"}},null,"City",{"$f":"VLOOKUP(Name,'Contractor Information'!$A$2:$K$2501,7,FALSE)","v":{"$error":"#N/A"}}]
["Phone Number",{"$f":"VLOOKUP(Name,'Contractor Information'!$A$2:$K$2501,11,FALSE)","v":{"$error":"#N/A"}},null,"Zip",{"$f":"VLOOKUP(Name,'Contractor Information'!$A$2:$K$2501,10,FALSE)","v":{"$error":"#N/A"}}]
["Completion Date",null,null,"State",{"$f":"VLOOKUP(Name,'Contractor Information'!$A$2:$K$2501,9,FALSE)","v":{"$error":"#N/A"}}]
[]
[null,"Contractor Performance Report"]
[null,"CATEGORY",null,null,null,null,"Max"]
[null,"    Element","Standard Comment (Per Applicable Rating)","Level","Rating","Score","Score","%"]
[null,"A. Contractor Work Performance (Max=70)"]
[null,"    A1.  Overall quality of work of the contractor (including subcontractors <$50,000)",{"$f":"IF(ISBLANK(Question1),\"\",VLOOKUP(Question1,'Final Ratings'!$A$10:$B$14,2,FALSE))","v":""},5,null,{"$f":"D13*E13","v":0},25,{"$f":"F13/G13","v":0}]
[null,"    A2.  Meeting of contract dates (including approved extensions)",{"$f":"IF(ISBLANK(Question2),\"\",VLOOKUP(Question2,'Final Ratings'!$A$19:$B$23,2,FALSE))","v":""},3,null,{"$f":"D14*E14","v":0},15,{"$f":"F14/G14","v":0}]
[null,"    A3. Completion of job closout activities (punch list, clean-up, paperwork, etc) in a timely manner",{"$f":"IF(ISBLANK(Question3),\"\",VLOOKUP(Question3,'Final Ratings'!$A$28:$B$32,2,FALSE))","v":""},3,null,{"$f":"D15*E15","v":0},15,0]
[null,"    A4. Cooperation/Coordination with KYTC's Project Staff",{"$f":"IF(ISBLANK(Question4),\"\",VLOOKUP(Question4,'Final Ratings'!$A$37:$B$41,2,FALSE))","v":""},3,null,{"$f":"D16*E16","v":0},15,0]
[null,"    CATEGORY A TOTAL",null,null,null,{"$f":"SUM(F13:F16)","v":0},{"$f":"SUM(G13:G16)","v":70},0]
[null,"B.Public Safety and Traffic Control (Max=40)"]
[null,"    B1. Maintenance of Traffic (proper signage, workers worked during allowable hours, public notification)",{"$f":"IF(ISBLANK(Question5),\"\",VLOOKUP(Question5,'Final Ratings'!$A$48:$B$52,2,FALSE))","v":""},3,null,{"$f":"D19*E19","v":0},15,0]
[null,"    B2.  Overall Safety of Employees (including subcontractors)",{"$f":"IF(ISBLANK(Question6),\"\",VLOOKUP(Question6,'Final Ratings'!$A$57:$B$61,2,FALSE))","v":""},5,null,{"$f":"D20*E20","v":0},25,0]
[null,"    CATEGORY B TOTAL",null,null,null,{"$f":"SUM(F19:F20)","v":0},{"$f":"SUM(G19:G20)","v":40},0]
[null,"C. Environmental Requirements (Max=15)"]
[null,"    C1. Performance of environmental mitigation methods (e.g. maintaining silt fencing, erosion control)",{"$f":"IF(ISBLANK(Question7),\"\",VLOOKUP(Question7,'Final Ratings'!$A$68:$B$73,2,FALSE))","v":""},3,null,{"$f":"D23*E23","v":0},{"$f":"IF(E23=0, \"0\", \"15\")","v":"0"},{"$f":"IF(E23=0, \"N/A\", F23/G23)","v":"N/A"}]
[null,"    CATEGORY C TOTAL",null,null,null,{"$f":"F23","v":0},{"$f":"IF(E23=0, \"N/A\", \"15\")","v":"N/A"},{"$f":"IF(E23=0, \"N/A\", F24/G24)","v":"N/A"}]
[null,"Section I Maximum Score ",null,null,null,{"$f":"F17+F21+F24","v":0},{"$f":"G17+G21+G23","v":110},{"$f":"F25/G25","v":0}]
["Comments:",null,null,null,null,null,null,{"$f":"H25*5","v":0}]
[]
[]
[]
[]
[]
[null,null,null,"District"]
[null,"            Print            ","            Print            ","    Date",{"$f":"TODAY()","v":"2021-10-26"}]
[]
[null,"_____________________________   Section ","__________________________   PD&P Branch Manager","TEBM Date"]
[null,"            Sign                                   Engineer","            Sign"]

{"sheet":"YrEndEval","index":2,"n_rows":35,"n_cols":8,"rows_kept":35,"cut":false,"hidden":false,"merged":[[6,4,6,6],[33,4,33,6],[1,0,1,7],[8,1,8,7],[0,1,0,5],[0,6,0,7],[31,4,31,5],[19,1,19,4],[30,3,30,4],[22,1,22,4],[24,1,28,6],[15,1,15,4],[2,3,2,4],[2,5,2,6],[3,4,3,6],[4,4,4,6],[5,4,5,6]]}
[null,"\nKentucky Transportation Cabinet   \n    Division of Construction Procurement                                                                   CONTRACTOR PERFORMANCE EVALUATION",null,null,null,null,"TC 63-74  04/2021"]
["Section 2: Interim/Year-End Evaluation"]
["Name",null,null,"Prime/Sub?",null,"Prime"]
["Contract ID#",null,null,"County","test"]
["Address",{"$f":"VLOOKUP(Name,'Contractor Information'!$A$2:$K$2501,4,FALSE)","v":{"$error":"#N/A"}},null,"City",{"$f":"VLOOKUP(Name,'Contractor Information'!$A$2:$K$2501,7,FALSE)","v":{"$error":"#N/A"}}]
["Phone Number",{"$f":"VLOOKUP(Name,'Contractor Information'!$A$2:$K$2501,11,FALSE)","v":{"$error":"#N/A"}},null,"Zip",{"$f":"VLOOKUP(Name,'Contractor Information'!$A$2:$K$2501,10,FALSE)","v":{"$error":"#N/A"}}]
[null,null,null,"State",{"$f":"VLOOKUP(Name,'Contractor Information'!$A$2:$K$2501,9,FALSE)","v":{"$error":"#N/A"}}]
[]
[null,"Contractor Performance Report"]
[null,"CATEGORY",null,null,null,null,"Max"]
[null,"    Element","Standard Comment (Per Applicable Rating)","Level","Rating","Score","Score","%"]
[null,"A. Contractor Work Performance (Max=70)"]
[null,"    A1.  Overall quality of work of the contractor (including subcontractors <$50,000)",{"$f":"IF(ISBLANK(Question1),\"\",VLOOKUP(Question1,'YrEnd Ratings'!$A$9:$B$11,2,FALSE))","v":""},5,null,{"$f":"D13*E13","v":0},25,{"$f":"F13/G13","v":0}]
[null,"    A2.  Meeting of contract dates (including approved extensions)",{"$f":"IF(ISBLANK(Question2),\"\",VLOOKUP(Question2,'YrEnd Ratings'!$A$16:$B$18,2,FALSE))","v":""},3,null,{"$f":"D14*E14","v":0},15,{"$f":"F14/G14","v":0}]
[null,"    A4. Cooperation/Coordination with KYTC's Project Staff",{"$f":"IF(ISBLANK(Question4),\"\",VLOOKUP(Question4,'YrEnd Ratings'!$A$23:$B$25,2,FALSE))","v":""},3,null,{"$f":"D15*E15","v":0},15,0]
[null,"    CATEGORY A TOTAL",null,null,null,{"$f":"SUM(F13:F15)","v":0},{"$f":"SUM(G13:G15)","v":55},0]
[null,"B.Public Safety and Traffic Control (Max=40)"]
[null,"    B1. Maintenance of Traffic (proper signage, workers worked during allowable hours, public notification)",{"$f":"IF(ISBLANK(Question5),\"\",VLOOKUP(Question5,'YrEnd Ratings'!$A$32:$B$34,2,FALSE))","v":""},3,null,{"$f":"D18*E18","v":0},15,0]
[null,"    B2.  Overall Safety of Employees (including subcontractors)",{"$f":"IF(ISBLANK(Question6),\"\",VLOOKUP(Question6,'YrEnd Ratings'!$A$39:$B$41,2,FALSE))","v":""},5,null,{"$f":"D19*E19","v":0},25,0]
[null,"    CATEGORY B TOTAL",null,null,null,{"$f":"SUM(F18:F19)","v":0},{"$f":"SUM(G18:G19)","v":40},0]
[null,"C. Environmental Requirements (Max=15)"]
[null,"    C1. Performance of environmental mitigation methods (e.g. maintaining silt fencing, erosion control)",{"$f":"IF(ISBLANK(Question7),\"\",VLOOKUP(Question7,'YrEnd Ratings'!$A$48:$B$51,2,FALSE))","v":""},3,null,{"$f":"D22*E22","v":0},{"$f":"IF(E22=0, \"0\", \"15\")","v":"0"},{"$f":"IF(E22=0, \"N/A\",F22/G22)","v":"N/A"}]
[null,"    CATEGORY C TOTAL",null,null,null,{"$f":"F22","v":0},{"$f":"IF(E22=0, \"N/A\", \"15\")","v":"N/A"},{"$f":"IF(E22=0, \"N/A\",F23/G23)","v":"N/A"}]
[null,"Section I Maximum Score ",null,null,null,{"$f":"F16+F20+F23","v":0},{"$f":"G16+G20+G22","v":95},{"$f":"F24/G24","v":0}]
["Comments:",null,null,null,null,null,null,{"$f":"H24*5","v":0}]
[]
[]
[]
[]
[]
[null,"__________________________","__________________________","District"]
[null,"            Print            ","            Print            ","    Date",{"$f":"TODAY()","v":"2021-10-26"}]
[]
[null,"__________________________   Section ","__________________________   PD&P Branch Manager","TEBM Date"]
[null,"            Sign                              Engineer","            Sign"]

{"sheet":"Contractor Information","index":3,"n_rows":2209,"n_cols":11,"rows_kept":2209,"cut":false,"hidden":false,"merged":[]}
["Vendor Name","Type","Vendor #","Address",null,null,"City    ",null,"State    ","Zip","Phone"]
["300 INDUSTRIAL LLC",99,"03583","5959 W LIBERTY ST 2ND FL",null,null,"HUBBARD",null,"OH","44425","(330)568-4380"]
["360 CONSTRUCTION COMPANY INC",99,"03158","1252 INDUSTRIAL PKWY N STE 1",null,null,"BRUNSWICK",null,"OH","44212","(216)883-5560"]
["3D ENTERPRISES CONTRACTING CORPORATION",99,"02090","3257 LOCHNESS DRIVE",null,null,"LEXINGTON",null,"KY","40517","(859)272-6618"]
["3-DS BRIDGE PAINTING CORPORATION",99,"02530","206 TARPON INDUSTRIAL CIRCLE",null,null,"TARPON SPRINGS",null,"FL","34689","(727)943-8401"]
["3M COMPANY",99,"03204","3M CENTER BUILDING 235-3A-09",null,null,"SAINT PAUL",null,"MN","55144","(651)736-7616"]
["A & A CONCRETE SAWING & DRILLING INC",99,"02796","P O BOX 72282",null,null,"LOUISVILLE",null,"KY","40272","(502)995-7500"]
["A & A CONCRETE SAWING AND DRILLING LLC",99,"02668","1452 HUGH AVENUE",null,null,"LOUISVILLE",null,"KY","40213","(502)238-3780"]
["A & A PAINTING",99,"03389","74 CREED CIRCLE",null,null,"CAMPBELL",null,"OH","44405","(330)750-0637"]
["A & A PAINTING OF OHIO LLC",99,"03611","74 CREED CIRCLE",null,null,"CAMPBELL",null,"OH","44405","(330)750-0637"]
["A & A SAFETY INC",99,"02413","1126 FERRIS RD",null,null,"AMELIA",null,"OH","45102","(513)943-6100"]
["A & B CONSTRUCTION LLC",99,"03765","P O BOX 647",null,null,"LONDON",null,"KY","40743","(606)878-2071"]
["A & G CONTRACTORS",99,"02433","1194 ST ANTHONY CHURCH ROAD",null,null,"CLARKSON",null,"KY","42726","(502)242-9565"]
["A & K CONSTRUCTION INC & SUBSIDIARY",99,"02485","100 CALLOWAY CT",null,null,"PADUCAH",null,"KY","42001","(270)441-7752"]
["A & L UNDERGROUND INC",99,"01617","14700 W 107TH STREET",null,null,"SHAWNEE MISSION",null,"KS","66215","(913)438-2981"]
["A & S SERVICES INC",99,"02294","P O BOX 352",null,null,"HENDERSON",null,"KY","42419-0352","(502)826-3412"]
["A B C CUTTING CONTRACTORS INC",99,"02542","136 PRODUCTION COURT",null,null,"LOUISVILLE",null,"KY","40299","(502)363-6601"]
["A B INC OF KY D/B/A HCL INC",99,"03443","1520 ALGONQUIN PKWY",null,null,"LOUISVILLE",null,"KY","40210","(502)638-9791"]
["A D E CONTRACTING INC",99,"03339","1044 DUNCAN RD",null,null,"LAWRENCEBURG",null,"KY","40342","(859)621-7941"]
["A I C CONSTRUCTION LLC",99,"02490","11441 INDUSTRIPLEX BLVD SUITE 140",null,null,"BATON ROUGE",null,"LA","70809","(225)295-4830"]
["A S L EXCAVATING INC",99,"02280","P O BOX 321",null,null,"FLEMINGSBURG",null,"KY","41041","(606)849-4511"]
["A V P INC",99,"03186","P O BOX 973",null,null,"HENDERSON",null,"KY","42419","(270)826-7711"]
["A-1 INDUSTRIAL MAINTENANCE INC",99,"03140","601 PENHALE AVE",null,null,"CAMPBELL",null,"OH","44405","(330)750-6200"]
["AAA ELECTRICAL CONTRACTORS LLC",99,"03052","1051 BRYANT WAY SUITE J",null,null,"BOWLING GREEN",null,"KY","42103","(270)842-5222"]
["AAA FENCE LLC",99,"03515","P O BOX 7729",null,null,"PADUCAH",null,"KY","42002","(270)444-6865"]
["AAD CONTRACTING INC",99,"03793","P O BOX 14287",null,null,"POLAND",null,"OH","44514","(330)398-8189"]
["AARON CONTRACTORS",99,"02096","RT 2 BOX 237",null,null,"ALBANY",null,"KY","42602","(606)387-7841"]
["ABATEMENT SOLUTIONS TECHNOLOGIES INC",99,"03726","444 TERRY BLVD",null,null,"LOUISVILLE",null,"KY","40229","(502)635-5051"]
["ABC CUTTING CONTRACTORS INC",99,"02932","5230 COMMERCE CIR",null,null,"INDIANAPOLIS",null,"IN","46237","(317)885-8989"]
["ABEL CONSTRUCTION COMPANY INC",99,"01873","2401 STANLEY GAULT PKWY",null,null,"LOUISVILLE",null,"KY","40223","(502)451-2235"]
["ABHE & SVOBODA INC",99,"01526","18100 DAIRY LN",null,null,"JORDAN",null,"MN","55352","(952)447-6025"]
["ABR CONSTRUCTION INC",99,"03436","121 CRESTVIEW CT",null,null,"NICHOLASVILLE",null,"KY","40356","(859)254-2866"]
["ACCESS LIMITED CONSTRUCTION COMPANY INC",99,"03671","1102 PIKE LN",null,null,"OCEANO",null,"CA","93445","(805)592-2230"]
["ACCIONA INFRAESTRUCTURAS S A",99,"03387","333 WEST WACKER DRIVE  SUITE 1500",null,null,"CHICAGO",null,"IL","60606","(514)658-6153"]
["ACCO INC",99,"02664","5515 POPLAR PARK BLVD",null,null,"LOUISVILLE",null,"KY","40228","(502)962-8844"]
["ACCURATE PROFILE GRINDING LLC",99,"03768","P O BOX 487",null,null,"ROGERS",null,"MN","55374","(763)428-0717"]
["ACE REBAR AND CONSTRUCTION INC",99,"03435","801 NORTH PINE HILLS ROAD",null,null,"ORLANDO",null,"FL","32808","(407)704-7803"]
["ACME CONCRETE PAVING INC",99,"03479","4124 E BROADWAY AVENUE",null,null,"SPOKANE",null,"WA","99202","(509)242-1234"]
["ADAMS CONTRACTING LLC",99,"03658","131 PROSPEROUS PL STE 19A",null,null,"LEXINGTON",null,"KY","40509","(859)629-4948"]
["ADAMS HIGHWAY SERVICES INC",99,"03855","10305 TROTTERS POINT DR UNIT 102",null,null,"LOUISVILLE",null,"KY","40241","(859)619-6933"]
["ADELPHI INC DBA G FORCE CONTRACTING",99,"02639","P O BOX 8629",null,null,"WARREN",null,"OH","44484","(330)755-0900"]
["ADLETA INC",99,"03213","389 S WAYNE AVE",null,null,"CINCINNATI",null,"OH","45215","(513)554-1469"]
["ADVANCE CONSTRUCTION OF KY LLC",99,"03107","341 PREAKNESS DRIVE",null,null,"LEXINGTON",null,"KY","40516","(859)361-6452"]
["ADVANCED ELECTRICAL SYSTEMS INC",99,"03160","P O BOX 36503",null,null,"LOUISVILLE",null,"KY","40233","(502)962-1102"]
["ADVANCED MULCHING TECHNOLOGIES INC",99,"02835","P.O. BOX 22273",null,null,"LEXINGTON",null,"KY","40522","(859)231-0500"]
["ADVANCED PAVING AND CONSTRUCTION",99,"01543","P O BOX 125",null,null,"EASTWOOD",null,"KY","40018","(502)245-8935"]
["ADVANTAGE BLASTING & DEMOLITION LLC",99,"03747","2900 S NOAH DRIVE",null,null,"SAXONBURG",null,"PA","16056","(878)208-1573"]
["ADVANTAGE ENTERPRISES INC",99,"02153","5030 ADVANTAGE DRIVE",null,null,"TOLEDO",null,"OH","43612","(419)727-0027"]
["AFFHOLDER INC",99,"03001","17988 EDISON AVENUE",null,null,"CHESTERFIELD",null,"MO","63005","(636)530-8000"]
["AGRADE CONSTRUCTION INC",99,"03691","P O BOX 1227 102 COUGAR DR",null,null,"ELKHORN CITY",null,"KY","41522","(606)369-5044"]
["AGRISCAPES",99,"02510","6456 CINCINNATI-DAYTON ROAD",null,null,"LIBERTY TOWNSHIP",null,"OH","45044","(513)779-7002"]
["AHERN & ASSOCIATES INC",99,"01946","PO BOX 9367  5725 KANAWHA TURNPIKE SW",null,null,"CHARLESTON",null,"WV","25309","(304)766-8062"]
["AIRFIELD ETC INC",99,"03836","3629 PRESCOTT RD",null,null,"MEMPHIS",null,"TN","38118","(901)601-7410"]
["AIRYS INC",99,"02608","7455 DUVAN DRIVE",null,null,"TINLEY PARK",null,"IL","60477","(708)429-0660"]
["AJA CONTRACTING LLC",99,"03198","2342 WEISENBERGER MILL ROAD",null,null,"MIDWAY",null,"KY","40347","(859)421-2737"]
["AKINS EXCAVATING COMPANY INC",99,"02715","182 BUSY LN",null,null,"CORBIN",null,"KY","40701","(606)528-9144"]
["AL JOHNSON CONSTRUCTION CO",99,"01196","SUITE 300      2626 E 82ND STREET",null,null,"BLOOMINGTON",null,"MN","55425","(612)854-5097"]
["ALADDIN ELECTRIC INC",99,"01744","P O BOX 600",null,null,"MANITOU",null,"KY","42436-0600","(270)821-1463"]
["ALBERICI CONSTRUCTORS INC",99,"03510","8800 PAGE AVENUE",null,null,"SAINT LOUIS",null,"MO","63114","(314)733-2000"]
["ALBERICI-KENNY JOINT VENTURE",99,"03559","8800 PAGE AVENUE",null,null,"SAINT LOUIS",null,"MO","63114","(314)733-2000"]
{"$rows_left_out":2150}
{"sheet":"YrEnd Ratings","index":4,"n_rows":51,"n_cols":2,"rows_kept":51,"cut":false,"hidden":false,"merged":[]}
[null,"Year-End Evaluation Report for Prime Contractor and Subcontractor(s)"]
[null,"Ratings Explanations"]
[]
[null,"Section A – Contractor Work Performance"]
[]
[null,"A1. Overall quality of work of the contractor (including subcontractors > $50,000)"]
[null,"Choose a rating of 1, 3 or 5 according to the following criteria:"]
[]
[1,"1: Poor "]
[3,"3: Average"]
[5,"5: Above Average"]
[]
[null,"A2. Meeting of all contract dates (including approved extensions)"]
[null,"Choose a rating of 1, 3 or 5 according to the following criteria:"]
[]
[1,"1: The project is behind schedule and it appears that the contractor will not be able to meet the project completion date or working days established for the project."]
[3,"3: The project is on schedule and it appears that the contractor will be able to meet the project completion date or working days established for the project."]
[5,"5: Project ahead of schedule and it appears that the contractor will be able to exceed the project completion date or working days established for the project."]
[]
[null,"A4. Cooperation/coordination with KYTC’s project staff"]
[null,"Choose a rating of 1, 3 or 5 according to the following criteria:"]
[]
[1,"1: Contractor did not adhere to submitted schedule and did not keep KYTC routinely informed of changes and problems. Requests for information/submittals/records/etc. were not handled in a timely manner."]
[3,"3: Cooperation/coordination was timely and satisfactorily."]
[5,"5: Contractor actively engaged as a project partner by coordinating progress meetings, scheduling work around events and delays, or by utilizing other resources to make the project a success.  "]
[]
[null,"Section B – Public Safety and Traffic Control"]
[]
[null,"B1. Maintenance of traffic (proper signage, workers worked during allowable hours, public notification)"]
[null,"Choose a rating of 1, 3, or 5 according to the following criteria:"]
[]
[1,"1: Contractor was directed numerous times to correct deficiencies in the work zone. Liquidated damages were assessed for failure to correct the noted deficiencies which were documented on the Traffic Control Inspection Report."]
[3,"3: Traffic control and public notification was acceptable."]
[5,"5: Total project involvement by actively engaging advance warning techniques, oversize vehicle considerations, media dissemination, law enforcement officers, and on site traffic technicians."]
[]
[null,"B2. Overall safety of employees (including subcontractors)"]
[null,"Choose a rating of 1, 3 or 5 according to the following criteria:"]
[]
[1,"1: Received OSHA citation and/or serious hazard(s) noted by SE and not immediately corrected. Safety issues were not being communicated with projects partners."]
[3,"3: The Section Engineer noted no hazards during the project."]
[5,"5: Total safety project involvement by all project partners. All partners are involved with safety meetings and communication of potential safety problems being distributed to all parties including SE and state personnel."]
[]
[null,"Section C – Environmental Requirements"]
[]
[null,"C1. Performance of environmental mitigation methods (e.g. maintaining silt fencing, erosion control)"]
[null,"Choose a rating of 0, 1, 3 or 5 according to the following criteria:"]
[]
[0,"0: Environmental mitigation methods do not apply to this project."]
[1,"1: Erosion control devices were not adequately maintained. Progressive seeding was not completed per contract requirements."]
[3,"3: Acceptable work and all erosion control reports addressed."]
[5,"5: Contractor was proactive in best management practices and/or used innovative erosion control techniques. Erosion control devices were adequately maintained. Progressive seeding was completed per contract requirements. "]

{"sheet":"Final Ratings","index":5,"n_rows":73,"n_cols":2,"rows_kept":73,"cut":false,"hidden":false,"merged":[]}
[null,"Final Evaluation Report for Prime Contractor and Subcontractor(s)"]
[null,"Ratings Explanations"]
[]
[null,"Section A – Contractor Work Performance"]
[]
[null,"A1. Overall quality of work of the contractor"]
[null,"(including subcontractors > $50,000)"]
[null,"Choose a rating from 1 to 5 according to the following criteria:"]
[]
[1,"1: Items were removed and replaced or deductions were made due to quality issues in accordance with specifications which totaled more than 5% of the total contract amount or the contractor failed to complete the project leading to a default of the contract. "]
[2,"2: Items were removed and replaced or deductions were made due to quality issues in accordance with specifications which totaled no more than 5% of the total contract amount."]
[3,"3: The work was acceptable with all corrective work items and noted deficiencies being addressed per specifications."]
[4,"4: No corrective work at final inspection."]
[5,"5: No corrective work at final inspection and no material failures on the contract."]
[]
[null,"A2. Meeting of all contract dates (including approved extensions)"]
[null,"Choose a rating from 1 to 5 according to the following criteria:"]
[]
[1,"1: Failed to complete the project by the established contract completion date and failed to meet an established milestone date in the contract."]
[2,"2: Failed to complete the project by the established contract completion date or failed to meet an established milestone date in the contract."]
[3,"3: Completed the project on schedule or up to 5% ahead of the contract completion date and met all established milestone dates in the contract."]
[4,"4: Completed the project between 5% and 10% ahead of the contract completion date and met all established milestone dates in the contract."]
[5,"5: Completed the project by more than 10% ahead of the contract completion date and met all established milestone dates in the contract."]
[]
[null,"A3. Completion of all job closeout activities (punch list, clean-up, paperwork, etc.) in a timely manner)"]
[null,"Choose a rating from 1 to 5 according to the following criteria:"]
[]
[1,"1: Failed to complete all corrective work and to submit all project documentation within 180 days of receiving the Comprehensive Final Inspection Report with the exception of the seeding and landscaping. "]
[2,"2: Failed to complete all corrective work and to submit all project documentation within 90 days of receiving the Comprehensive Final Inspection Report with the exception of the seeding and landscaping. "]
[3,"3: Completed all corrective work and submitted all project documentation within 90 days of receiving the Comprehensive Final Inspection Report except for seeding and landscaping."]
[4,"4: Completed all corrective work submitted all project documentation within 30 days of receiving the Comprehensive Final Inspection Report except for seeding and landscaping."]
[5,"5: There was no corrective work on this project and all project documentation was submitted as requested."]
[]
[null,"A4. Cooperation/coordination with KYTC’s project staff"]
[null,"Choose a rating from 1 to 5 according to the following criteria:"]
[]
[1,"1: Contractor did not adhere to submitted schedule and did not keep KYTC informed of changes and problems. Requests for information/submittals/records/etc. were routinely ignored. Numerous complaints from private citizens were not addressed."]
[2,"2: Contractor did not adhere to submitted schedule and did not keep KYTC routinely informed of changes and problems.  Requests for information/submittals/records/etc. were not handled in a timely manner."]
[3,"3: Cooperation/coordination was timely and satisfactory throughout the project."]
[4,"4: Contractor actively coordinated/communicated with Cabinet personnel and attempted to minimize the impact of delays on the project.   "]
[5,"5: Contractor actively engaged as a project partner by coordinating progress meetings, scheduling work around events and delays, or by utilizing other resources to make the project a success. Contractor not only attempted to minimize impact of delays for the Cabinet, but put forth valuable suggestions to enhance project."]
[]
[null,"Section B – Public Safety and Traffic Control"]
[]
[null,"B1. Maintenance of traffic (proper signage, workers worked during allowable hours, public notification)"]
[null,"Choose a rating from 1 to 5 according to the following criteria:"]
[]
[1,"1: Contractor was directed numerous times to correct deficiencies in the work zone. Liquidated Damages were assessed for failure to correct the noted deficiencies which were documented on the Traffic Control Inspection Report."]
[2,"2: Contractor was directed to correct deficiencies in the work zone less than 5 times during the project.  Contractor completed any noted deficiencies in a timely manner and liquidated damages were not assessed."]
[3,"3: Traffic Control devices were installed as per standards with minimal direction."]
[4,"4: Traffic Control devices were installed as per standards with no direction from KYTC."]
[5,"5: Total project involvement by actively engaging advance warning techniques, oversize vehicle considerations, media dissemination, law enforcement officers, and on-site traffic control technicians."]
[]
[null,"B2. Overall safety of employees (including subcontractors)"]
[null,"Choose a rating from 1 to 5 according to the following criteria:"]
[]
[1,"1: Received an OSHA citation and/or a serious hazard was noted by the Section Engineer and the issue(s) were not immediately corrected. Safety issues were not communicated with project partners."]
[2,"2: Minor hazards noted by the Section Engineer, minimal communication regarding safety issues."]
[3,"3: The Section Engineer noted no hazards during the project."]
[4,"4: Safety meetings were held (must be verified in order to rate). Any safety concerns were communicated."]
{"$rows_left_out":13}